program: Gaussian 09
title: 000152033
version: EM64L-G09RevD.01
frameworkgroup: C1[X(C19H24O2S)]
method: RPBEPBE
basis: SDD
operation: Freq
keyword: #p
keyword: freq=noraman
keyword: PBEPBE/SDD
title: #p freq=noraman PBEPBE/SDD
converged: YES YES NO NO
title: Mulliken charges:
elementType: S O O C C C C C C C C C C C C C C C C C C C H H H H H H H H H H H H H H H H H H H H H H H H
charge: 0.259489 -0.284030 -0.275574 0.412271 0.433650 -0.339228 -0.304512 -0.739684 -0.820902 -0.777195 -0.330860 0.395479 -0.356164 -0.834277 -0.222503 0.453631 -0.314175 -0.848641 -0.479247 0.217254 -0.221573 -0.674933 0.234681 0.274849 0.230253 0.233034 0.235625 0.247631 0.238875 0.237891 0.235964 0.214126 0.230959 0.235756 0.233701 0.234468 0.222546 0.226386 0.225019 0.305529 0.240613 0.223975 0.225245 0.207928 0.228337 0.228333
chargesum: 0.00000
title: Mulliken charges with hydrogens summed into heavy atoms:
elementType: S O O C C C C C C C C C C C C C C C C C C C
charge: 0.259489 -0.284030 -0.275574 0.412271 0.433650 -0.339228 -0.069831 -0.464834 -0.121990 -0.052798 -0.094896 0.395479 -0.142039 -0.133861 0.011965 0.453631 -0.091628 -0.091707 -0.238634 0.217254 0.227647 -0.010335
polarizability: 8.13042799e+02 -4.24772098e+00 2.37768108e+02 2.18446665e+00 -1.18219378e+00 1.20620352e+02
1716.lowfreq: -0.0011 -0.0007 0.0020 1.9025 2.9795 8.3489 11.6104 25.4491 27.3692
frequency: 11.3622 25.4367 27.3533 33.0688 50.6564 68.2857 74.2395 81.3585 89.4669 119.2611 134.5430 140.2262 145.7850 150.6420 174.4681 187.7569 199.0104 204.7206 238.7468 244.3302 252.0571 259.1808 262.8121 287.1067 289.5893 313.4971 315.8405 327.7090 354.6318 389.2346 411.2372 413.2742 480.0158 488.1301 520.5584 527.0745 536.0191 541.0448 593.0059 618.0953 653.8394 684.3702 686.7205 726.4164 743.0976 797.8506 802.0648 815.6534 843.5349 845.3573 858.6724 865.6146 878.4525 904.5363 910.6987 957.9309 962.5128 978.5379 978.9003 1009.8761 1024.5774 1025.3248 1033.6217 1037.9141 1042.4972 1043.6673 1046.7079 1103.0302 1113.5467 1117.2221 1135.3920 1168.1485 1183.6054 1214.3228 1234.2577 1247.1373 1256.6464 1279.8971 1299.3744 1315.6972 1327.1787 1350.9531 1379.1522 1384.7031 1391.7537 1398.3025 1400.8078 1401.1882 1401.6131 1406.8637 1463.0653 1464.0024 1466.0382 1469.6218 1470.9336 1472.8100 1473.1699 1473.9634 1476.8859 1487.0191 1495.8025 1502.0528 1559.0043 1564.7443 1580.1162 1597.7518 1613.3840 1630.9202 2964.5888 2973.8158 2978.9883 2979.2508 2993.8986 3002.8012 3040.8761 3050.0455 3050.8922 3053.6069 3059.2699 3075.3798 3082.5500 3086.0965 3087.8358 3090.4320 3104.5972 3108.6638 3113.8054 3122.6363 3128.1499 3136.7033 3138.9629 3229.2147
redmass: 3.6008 5.2573 4.7145 3.1740 2.7097 4.5988 5.0091 2.6722 3.5429 4.2427 2.3469 1.3922 2.9187 1.0876 1.9769 1.2522 1.8982 3.3399 2.3256 1.8524 1.4584 3.8125 3.0713 2.6051 2.5795 3.2353 2.7398 4.8895 3.2274 3.4578 3.9848 4.1156 4.3081 3.4250 3.1252 5.1724 6.4294 2.3290 4.1644 3.3655 4.2230 4.4410 4.6675 5.8765 1.2304 1.0997 4.9410 3.7818 1.9693 2.1827 3.7580 1.8840 2.6603 1.5476 1.6437 4.7093 1.1198 1.4687 1.6043 1.5928 1.5573 1.6538 2.1662 1.5114 1.8910 1.5118 1.5300 2.6807 2.1130 2.3889 1.4666 1.4909 3.3476 1.5170 2.4578 1.1362 1.6140 1.6489 1.6048 2.5675 1.4275 1.3963 1.6126 1.5511 2.5217 1.3170 1.3377 1.2291 1.3142 1.5779 1.1217 1.0404 1.0880 1.1668 1.0581 1.0568 1.0711 1.1589 1.0756 1.0692 1.0482 3.6770 4.3131 5.2720 5.3357 6.9012 5.2231 5.1537 1.0385 1.0377 1.0391 1.0399 1.0360 1.0578 1.0969 1.0970 1.0979 1.0964 1.1064 1.0887 1.0975 1.0902 1.0977 1.0985 1.1021 1.0950 1.0886 1.0973 1.0879 1.0894 1.0873 1.0962
irintensity: 0.0843 0.0313 0.4067 0.6717 0.0128 0.3119 1.3391 1.5188 0.3676 1.1003 3.2591 0.0416 0.4496 1.6767 0.9053 0.1222 5.1957 3.9998 0.6349 0.4266 0.9624 4.2245 0.4433 3.9183 3.0029 5.1688 5.6375 12.1611 1.0022 8.1789 1.8320 9.4818 7.7286 4.0992 6.8892 7.5310 1.2451 1.0676 5.7911 1.7888 32.8937 1.2953 1.7272 13.0881 48.2085 4.3304 3.8638 3.1546 6.5962 5.5840 5.8430 0.8313 3.1574 12.5386 0.4774 172.2541 2.7022 76.1152 56.1347 0.7774 18.0497 67.6931 69.0182 4.5046 148.0876 7.4216 0.5036 729.6355 10.5234 374.5440 5.4548 1.8684 3.7276 22.1720 7.5065 0.1203 163.0277 6.6203 5.7554 29.7897 23.1017 52.6698 126.0464 14.6197 31.7421 65.2073 21.4465 16.9734 24.3863 32.2476 212.9257 11.3863 18.3225 18.1104 5.2011 37.1837 24.1871 78.9158 4.6299 13.6691 17.3440 121.3096 604.9650 43.4863 344.2869 104.0841 221.4443 23.8837 14.0219 27.2276 15.0754 41.1771 33.7341 36.9071 15.5915 15.1955 21.3728 18.0763 13.4745 9.2808 19.8101 13.9754 35.0585 42.0286 46.6940 13.7672 6.1192 4.6071 30.1983 9.9095 26.6356 0.7064
temp: 298.150 k
press: 1.00000 atm
elementType: 16 8 8 6 6 6 6 6 6 6 6 6 6 6 6 6 6 6 6 6 6 6 1 1 1 1 1 1 1 1 1 1 1 1 1 1 1 1 1 1 1 1 1 1 1 1
symmnumber: 1
zpe: 987905.6 jmol-1
zpe.correction: 0.376273 hartree
zpe.thermalcorrener: 0.401611 hartree
zpe.thermalcorrenthalpy: 0.402555 hartree
zpe.thermalcorrgfe: 0.317905 hartree
zpe.sumelectzpe: -1285.251405 hartree
zpe.sumelectthermal: -1285.226067 hartree
zpe.sumelectthermalent: -1285.225123 hartree
zpe.sumelectthermalfe: -1285.309773 hartree
dipole: 3.0941 0.1885 0.0917
dipole: 3.1011
quadrupole: -139.6153 -130.6805 -145.4552
quadrupole: -19.6719 -0.3323 -0.7655
quadrupole: -1.0316 7.9032 -6.8715 -19.6719 -0.3323 -0.7655
hfenergy: -1285.6276784 hartree
pointgroup: C01 [X(C19H24O2S1)]
dipole: -1.2157716 -0.0684396 0.0763077 debye
polarizability: 812.1799275|-6.6104517|237.7962706|-23.9079125|-1.5420423|121.4550615 unknown
InChI: InChI=1S/C19H24O2S/c1-6-21-19(20)12-15(3)9-7-8-14(2)10-11-18-16(4)13-22-17(18)5/h7-13H,6H2,1-5H3
charge 0 multiplicity 1
46 atoms
S  -7.132411 -2.002182 0.180913
O  6.863167 -1.250688 -0.165043
O  6.705894 1.065141 -0.436097
C  -5.187003 -0.189898 0.099398
C  -6.439203 0.548279 0.328205
C  -5.389394 -1.577954 -0.010425
C  -3.91831 0.52644 -0.010722
C  -7.547574 -0.269862 0.400895
C  -6.516301 2.05205 0.479592
C  -4.41165 -2.689155 -0.276039
C  -2.631527 0.02279 -0.027847
C  -1.420861 0.824393 -0.151813
C  -0.191913 0.165111 -0.130681
C  -1.547511 2.33064 -0.296849
C  1.120478 0.748825 -0.232881
C  3.639987 0.542967 -0.288068
C  2.288535 0.004519 -0.192685
C  3.830031 2.040098 -0.453471
C  4.694667 -0.356774 -0.220388
C  6.127934 -0.049263 -0.290843
C  8.34479 -1.106307 -0.213073
C  8.929484 -2.500788 -0.007448
H  -4.024766 1.617387 -0.07433
H  -8.586084 0.00886 0.569431
H  -6.163749 2.57155 -0.431956
H  -7.554267 2.375752 0.664954
H  -5.897008 2.406654 1.324849
H  -3.755792 -2.439342 -1.131565
H  -3.76035 -2.880791 0.599503
H  -4.928384 -3.634369 -0.514146
H  -2.469181 -1.056178 0.076174
H  -0.218478 -0.930729 -0.021165
H  -0.57152 2.830506 -0.38623
H  -2.141149 2.591686 -1.193472
H  -2.067855 2.768141 0.576598
H  1.200259 1.837007 -0.346085
H  2.203604 -1.086886 -0.077596
H  3.337647 2.391166 -1.380265
H  3.364795 2.584359 0.390213
H  4.896319 2.301383 -0.499363
H  4.47332 -1.423743 -0.097961
H  8.624523 -0.670609 -1.190121
H  8.655911 -0.396092 0.575053
H  10.033602 -2.453839 -0.035235
H  8.623081 -2.914956 0.968465
H  8.590511 -3.190599 -0.799379
