program: Gaussian 09
title: 000152031
version: EM64L-G09RevD.01
frameworkgroup: C1[X(C12H16N2O3)]
method: RPBEPBE
basis: SDD
operation: Freq
keyword: #p
keyword: freq=noraman
keyword: PBEPBE/SDD
title: #p freq=noraman PBEPBE/SDD
converged: YES YES NO NO
title: Mulliken charges:
elementType: O O O N N C C C C C C C C C C C C H H H H H H H H H H H H H H H H
charge: -0.302261 -0.266964 -0.316035 -0.367168 -0.453237 -0.112941 0.232233 -0.702621 -0.344262 0.473203 -0.649475 0.285860 -0.440341 -0.354535 -0.194608 -0.208687 -0.254299 0.254285 0.219268 0.253009 0.225153 0.214557 0.251309 0.351340 0.235022 0.209365 0.215104 0.336015 0.225353 0.297815 0.229324 0.227949 0.231272
chargesum: 0.00000
title: Mulliken charges with hydrogens summed into heavy atoms:
elementType: O O O N N C C C C C C C C C C C C
charge: -0.302261 -0.266964 -0.316035 -0.015828 -0.117223 0.141344 0.232233 -0.005191 0.121604 0.473203 0.010015 0.285860 -0.214988 -0.056720 0.034716 0.019262 -0.023027
polarizability: 2.21435438e+02 -1.73496775e+01 1.52258258e+02 -9.35107947e+00 -1.93013463e+01 1.04458315e+02
1716.lowfreq: -7.1898 -0.0004 -0.0002 0.0005 2.8457 3.9255 24.1033 28.1646 38.6402
frequency: 23.6172 28.0439 38.5928 56.3001 77.4626 90.7334 109.3343 121.7425 168.3123 189.1119 207.1158 225.9105 250.4549 263.0399 287.2685 327.2320 347.4352 373.9530 408.0686 420.0556 489.7770 508.2485 569.5838 612.8691 626.5549 651.4277 694.1603 697.5801 703.2759 731.0340 760.9376 767.1518 775.8061 798.8132 842.6992 862.4353 871.2962 895.7471 915.5546 973.5713 982.1868 988.6129 997.0511 1012.0995 1029.6963 1059.6320 1074.1794 1091.3794 1093.2503 1150.8177 1162.5541 1173.3553 1175.7016 1190.8398 1230.3918 1256.1795 1291.2663 1311.0642 1327.0889 1329.1709 1355.8305 1384.2215 1387.0796 1397.4680 1435.5147 1456.5714 1464.0402 1464.8050 1469.1642 1481.4910 1486.0160 1518.6384 1527.1865 1602.6914 1614.5366 1623.3728 1649.1209 2983.6264 3000.7715 3008.2231 3019.2450 3067.5962 3084.3696 3098.3514 3105.6540 3116.0410 3123.1029 3134.0791 3146.6209 3167.0423 3191.9274 3409.9385 3536.8276
redmass: 2.8797 3.9743 4.2812 6.6650 4.4010 4.3294 4.4246 5.5814 2.2176 1.1087 2.5409 2.2670 3.7978 3.1888 3.6289 3.8545 7.2706 4.6211 2.9158 3.8979 3.2617 2.8748 6.0070 6.2849 3.9392 1.5309 2.7872 2.6600 4.5576 3.9802 1.2765 1.6414 1.4735 3.2081 1.2625 3.6290 2.4023 2.4681 1.4267 1.3586 6.6865 6.9592 1.3062 1.8563 2.1079 3.2513 1.7879 1.5626 1.9419 1.9138 2.5358 1.1808 2.2641 1.1228 2.0782 2.1341 1.1346 1.2545 1.5585 1.4910 1.3017 1.2134 7.8004 1.2469 2.3591 1.0439 1.0752 1.0497 1.0493 1.0613 2.2703 1.9892 1.8763 5.0831 6.4007 7.3366 6.3704 1.0353 1.0637 1.0374 1.0837 1.0996 1.0985 1.1022 1.0994 1.0885 1.1006 1.0870 1.0935 1.0997 1.0951 1.0809 1.0760
irintensity: 0.0951 0.5928 0.9944 8.1768 0.3524 1.1138 2.6038 6.7879 3.5973 0.0680 2.9296 11.0404 4.5870 5.1987 3.0005 16.0956 5.4815 5.4684 0.0190 11.0811 3.6438 25.4655 3.8166 0.7611 5.3212 14.6657 10.6903 66.7701 32.1767 16.2128 123.1545 116.2634 13.9816 41.5237 0.5267 1.4758 0.3971 7.0309 13.9686 0.0783 102.1064 101.3499 1.9810 70.3285 3.9496 0.0876 150.1279 18.5694 9.6525 31.9273 65.6246 42.2046 202.3439 13.5076 59.3959 7.2568 20.7989 12.9242 13.5567 26.9753 4.2595 19.2581 45.4692 35.7976 115.5285 15.0085 17.4827 9.9490 10.8892 12.5277 28.3419 451.2783 271.3605 26.1079 264.4895 82.9655 227.8041 30.9053 36.9270 11.5789 13.2202 3.5941 44.6980 32.8520 21.5594 12.5638 13.0617 0.7435 28.0577 22.5692 5.3431 209.5148 35.1148
temp: 298.150 k
press: 1.00000 atm
elementType: 8 8 8 7 7 6 6 6 6 6 6 6 6 6 6 6 6 1 1 1 1 1 1 1 1 1 1 1 1 1 1 1 1
symmnumber: 1
zpe: 701011.6 jmol-1
zpe.correction: 0.267001 hartree
zpe.thermalcorrener: 0.284289 hartree
zpe.thermalcorrenthalpy: 0.285233 hartree
zpe.thermalcorrgfe: 0.219535 hartree
zpe.sumelectzpe: -800.814843 hartree
zpe.sumelectthermal: -800.797555 hartree
zpe.sumelectthermalent: -800.796611 hartree
zpe.sumelectthermalfe: -800.862309 hartree
dipole: -3.1056 0.3794 -0.6911
dipole: 3.2041
quadrupole: -102.0115 -91.5422 -102.9052
quadrupole: 7.3154 -10.9241 0.0763
quadrupole: -3.1919 7.2774 -4.0856 7.3154 -10.9241 0.0763
hfenergy: -801.0818441 hartree
pointgroup: C01 [X(C12H16N2O3)]
dipole: -1.1733066 -0.1282005 0.4427097 debye
polarizability: 220.4518559|17.2633716|144.8070482|-6.6651771|-28.7394246|112.8931063 unknown
InChI: InChI=1S/C12H16N2O3/c1-3-13-11(15)9(2)17-12(16)14-10-7-5-4-6-8-10/h4-9,13-14H,3H2,1-2H3
charge 0 multiplicity 1
33 atoms
O  0.91766 1.574403 -0.417128
O  3.968286 0.7428 -1.644186
O  0.409657 -0.166941 1.093674
N  2.866635 -0.814666 -0.289278
N  -1.229897 0.912172 -0.2361
C  2.35469 1.569596 0.040292
C  3.14175 0.464013 -0.72247
C  2.89457 2.963915 -0.243638
C  3.502908 -2.003851 -0.880968
C  -2.431223 0.231604 0.115092
C  4.589768 -2.610046 0.033457
C  0.047049 0.684911 0.231466
C  -3.619695 0.630437 -0.55296
C  -2.478172 -0.801099 1.087742
C  -4.844804 0.001604 -0.253421
C  -3.713819 -1.420866 1.374208
C  -4.900403 -1.030012 0.71277
H  2.343523 1.335234 1.12206
H  2.27329 3.725477 0.256993
H  2.918149 3.152222 -1.328495
H  3.930483 3.042861 0.128734
H  2.720647 -2.756433 -1.096237
H  3.948057 -1.686448 -1.83948
H  2.145577 -0.926174 0.437951
H  5.392597 -1.874942 0.216032
H  4.170198 -2.91721 1.008892
H  5.037311 -3.501535 -0.443409
H  -1.301246 1.658458 -0.932126
H  -3.584079 1.428729 -1.305314
H  -1.563547 -1.101878 1.602175
H  -5.754385 0.317762 -0.775612
H  -3.745401 -2.217574 2.125815
H  -5.852135 -1.518823 0.945371
