program: Gaussian 09
title: 000152027
version: EM64L-G09RevD.01
frameworkgroup: C1[X(C12H8N4O2)]
method: RPBEPBE
basis: SDD
operation: Freq
keyword: #p
keyword: freq=noraman
keyword: PBEPBE/SDD
title: #p freq=noraman PBEPBE/SDD
converged: YES YES NO NO
title: Mulliken charges:
elementType: O O N N N N C C C C C C C C C C C C H H H H H H H H
charge: -0.203750 -0.187639 -0.453911 -0.017984 0.048768 0.021378 0.081229 0.405211 0.291293 -0.206791 -0.482481 -0.369900 -0.330148 0.377616 -0.201039 -0.371234 -0.142664 -0.371920 0.315196 0.336335 0.206616 0.244020 0.241043 0.292250 0.231944 0.246559
chargesum: 0.00000
title: Mulliken charges with hydrogens summed into heavy atoms:
elementType: O O N N N N C C C C C C C C C C C C
charge: -0.203750 -0.187639 -0.138715 -0.017984 0.048768 0.021378 0.081229 0.405211 0.291293 -0.206791 -0.146146 -0.163284 -0.086129 0.377616 0.040005 -0.078983 0.089280 -0.125361
polarizability: 3.21054347e+02 -1.82024661e+01 1.74084088e+02 1.44685005e-01 1.01847528e-01 6.14574354e+01
1716.lowfreq: 0.0006 0.0006 0.0008 2.6031 3.4075 10.8178 25.5952 46.3388 72.1615
frequency: 25.5269 46.3238 72.1545 74.3529 160.1258 189.2758 200.6670 242.6516 266.1698 322.9000 342.7368 391.5508 426.6798 434.7613 499.6795 518.7664 550.1234 569.4439 580.8355 595.0878 624.1253 646.7042 673.3727 693.0871 694.0764 730.2121 775.7289 785.6159 801.2539 815.4521 832.6474 887.4470 917.7098 925.5089 933.5827 966.5980 980.4710 987.2142 997.3237 1025.3688 1078.3358 1089.7821 1093.0680 1112.4654 1182.0211 1191.3715 1215.3099 1243.4534 1276.1545 1294.9045 1299.2653 1326.5724 1362.6352 1377.7715 1391.2384 1397.1330 1439.1710 1448.0957 1461.5352 1536.0376 1549.1092 1585.2973 1616.6746 1620.6820 3129.3369 3137.0168 3146.3935 3161.9165 3173.0499 3181.2314 3190.6685 3591.0700
redmass: 5.8782 11.3201 6.0351 8.0273 5.5425 4.5657 7.8282 4.3738 8.7240 5.3109 6.0165 8.2948 3.3638 4.1809 7.4815 5.6477 5.8094 7.1190 1.7632 1.8656 7.7345 7.2511 4.5787 9.8173 2.1788 6.7108 8.6828 1.6742 3.3938 1.6538 6.8327 7.0501 1.3706 1.4423 7.1028 1.3680 1.4512 6.1532 1.3570 2.3881 1.6940 1.6982 3.6738 1.5689 1.1565 2.4433 7.2624 1.6402 3.0531 1.8453 2.6517 2.7173 6.7874 10.8516 2.6180 4.4469 2.6920 3.1264 2.5312 4.7961 7.5176 6.6491 7.2780 6.8843 1.0887 1.0883 1.0923 1.0931 1.0992 1.0928 1.0963 1.0810
irintensity: 5.0526 0.0033 0.7887 0.3577 3.3109 0.0919 5.1971 3.9559 0.5831 0.9892 0.6494 2.7409 0.7854 1.0357 3.3777 1.2789 6.4679 0.0789 26.1667 50.7183 0.8385 2.8926 3.5009 29.1059 65.2321 0.1843 13.9885 68.9343 25.1580 30.9831 2.5664 3.6899 0.1105 0.0347 2.6568 1.7852 21.2127 0.2666 0.2996 1.5553 25.5727 20.6255 7.2261 7.0197 26.6644 3.2150 218.2654 53.5863 32.0536 72.5987 1.4621 37.4163 8.8308 109.4901 5.0830 16.4250 18.6628 62.5970 36.9264 10.3335 14.6371 1.1612 5.3740 10.3935 16.5452 11.0304 11.6377 13.7975 26.6738 10.9180 6.3772 24.5809
temp: 298.150 k
press: 1.00000 atm
elementType: 8 8 7 7 7 7 6 6 6 6 6 6 6 6 6 6 6 6 1 1 1 1 1 1 1 1
symmnumber: 1
zpe: 485098.2 jmol-1
zpe.correction: 0.184764 hartree
zpe.thermalcorrener: 0.198205 hartree
zpe.thermalcorrenthalpy: 0.199149 hartree
zpe.thermalcorrgfe: 0.142823 hartree
zpe.sumelectzpe: -830.223000 hartree
zpe.sumelectthermal: -830.209559 hartree
zpe.sumelectthermalent: -830.208614 hartree
zpe.sumelectthermalfe: -830.264941 hartree
dipole: 4.3300 9.3102 0.0326
dipole: 10.2678
quadrupole: -102.4916 -100.2007 -105.6233
quadrupole: -3.8181 0.1626 -0.0037
quadrupole: 0.2803 2.5712 -2.8514 -3.8181 0.1626 -0.0037
hfenergy: -830.4077639 hartree
pointgroup: C01 [X(C12H8N4O2)]
dipole: 1.6584225 -3.6805952 0.1478763 debye
dipolederiv: -0.95658 -0.0125962 -0.02271 0.1455964 -0.4780132 0.0128416 -0.0280912 0.0078001 -0.2279824 -0.551053 0.0181608 -0.0112981 0.0829417 -0.7750034 0.0210016 -0.0134485 0.0189516 -0.2127413 -0.5058627 0.0664558 -0.0083148 -0.0818645 -0.4512162 0.0015671 -0.0038152 0.0067513 -0.265667 -0.4991313 -0.2024705 -0.0030105 -0.0488074 -0.3893507 0.0012388 -0.0088191 -0.0034949 -0.2491526 -0.1015919 0.0262904 0.002849 0.0117581 -0.2712912 0.0012582 0.0036787 0.0019276 -0.2191225 1.5154089 -0.2199349 0.0492876 -0.5151557 1.2912829 -0.0524533 0.0589465 -0.0429822 0.1887776 0.4168544 -0.1854483 0.0146086 -0.2306518 0.5350187 -0.0157377 0.0148129 -0.0166093 0.0804907 0.5495033 0.1666714 0.0112206 0.1311891 -0.1296875 0.0089346 0.0131317 0.0106799 0.0287265 -0.179699 0.1101898 -0.0117776 0.5216918 0.0105677 0.0179005 -0.0213978 0.0062796 0.1278694 0.4825687 0.2209657 0.0073748 -0.2008039 0.1000615 -0.0065326 0.0187486 0.0059724 0.0601288 -0.1794362 -0.2086576 0.0035062 0.0840442 -0.0258095 0.0008874 -0.006399 -0.0078603 -0.0759887 -0.0279624 -0.0540011 0.0062169 -0.0997467 0.0420192 -0.0096937 0.0081449 -0.0083747 -0.1448177 0.4313797 -0.0284479 0.0179258 0.0009682 0.1219363 -0.006572 0.0164943 -0.0075753 -0.1646499 -0.1376903 0.2360196 -0.0140486 0.3047473 -0.2050887 0.0185069 -0.0155451 0.0163465 0.0625551 -0.2351895 0.1020142 -0.0067778 0.254987 0.1614319 -0.0011306 -0.0125092 -0.0062518 -0.1257523 -0.1916173 0.0373366 -0.0035854 -0.333812 -0.0001861 -0.0142082 0.0083336 -0.0024709 -0.1135214 -0.1654565 -0.0243145 -0.0011914 -0.5492681 -0.2063108 -0.0141604 0.0109032 0.0012257 -0.1168133 -0.0900343 -0.0228933 0.0003449 0.5485515 0.3432802 0.0062537 -0.0126426 -0.0106473 -0.0956936 0.2135594 -0.0340147 -0.00264 -0.0313522 0.1375397 0.0037368 -0.0035631 0.0039798 0.341428 0.204983 -0.01283 0.0016534 -0.0449339 0.110605 0.0005967 0.0030542 0.0013706 0.1680952 -0.003542 0.1357472 -0.009334 0.1245657 -0.0053876 0.0091125 -0.009094 0.009364 0.1471071 0.072675 0.020115 -0.0031782 0.0747784 -0.0694801 0.0076128 -0.0043457 0.0061011 0.1701122 0.0481446 -0.0464456 -0.0019908 -0.065262 -0.0762971 0.0054556 -0.0014625 0.0060807 0.1561643 0.0595441 -0.031398 -0.0027767 -0.0063074 0.1387089 0.0010038 -0.0034263 0.0001496 0.1756698 -0.1108169 0.0356853 -0.008733 0.0400517 0.0886463 0.0029006 -0.0086593 0.0028424 0.1669257 -0.058958 -0.0921991 -0.0036212 -0.1179057 0.0020237 -0.0003208 -0.0030302 0.000444 0.1378523 unknown
polarizability: 321.2255489|16.6274554|173.6025934|7.5736131|-2.6713722|61.7677286 unknown
InChI: InChI=1S/C12H8N4O2/c17-16(18)9-4-1-3-8(7-9)11-14-10-5-2-6-13-12(10)15-11/h1-7,14H
charge 0 multiplicity 1
26 atoms
O  -5.342692 0.936867 -0.183101
O  -3.619392 2.430123 -0.176541
N  1.637929 -1.335152 0.102339
N  1.115611 0.892719 0.03588
N  3.430671 1.74733 0.084283
N  -4.084994 1.229362 -0.152476
C  0.618171 -0.361672 0.04974
C  -0.814811 -0.683084 0.014149
C  2.858903 -0.659481 0.122714
C  2.511473 0.742225 0.080792
C  -1.740089 0.391363 -0.049969
C  -1.304177 -2.01812 0.041415
C  4.205687 -1.066085 0.169796
C  -3.114005 0.100738 -0.084898
C  -2.690829 -2.279575 0.005061
C  -3.616883 -1.219517 -0.058871
C  5.153839 -0.019938 0.173106
C  4.729297 1.342402 0.130358
H  1.509563 -2.344984 0.121449
H  -1.376185 1.422296 -0.07151
H  -0.613897 -2.868455 0.092423
H  4.510564 -2.1170 0.202202
H  -3.050263 -3.313029 0.026986
H  -4.696072 -1.387922 -0.088329
H  6.224693 -0.242023 0.208411
H  5.475688 2.144413 0.133694
