program: Gaussian 09
title: 000152026
version: EM64L-G09RevD.01
frameworkgroup: C1[X(C12H8N4O2)]
method: RPBEPBE
basis: SDD
operation: Freq
keyword: #p
keyword: freq=noraman
keyword: PBEPBE/SDD
title: #p freq=noraman PBEPBE/SDD
converged: YES YES NO NO
title: Mulliken charges:
elementType: O O N N N N C C C C C C C C C C C C H H H H H H H H
charge: -0.203839 -0.209833 -0.450787 -0.018544 0.048073 0.026894 0.072562 0.397347 0.294503 -0.204620 -0.344445 -0.340714 -0.327970 0.382218 -0.363182 -0.375829 -0.140909 -0.370579 0.317962 0.297808 0.207863 0.245906 0.291060 0.288345 0.233258 0.247452
chargesum: 0.00000
title: Mulliken charges with hydrogens summed into heavy atoms:
elementType: O O N N N N C C C C C C C C C C C C
charge: -0.203839 -0.209833 -0.132824 -0.018544 0.048073 0.026894 0.072562 0.397347 0.294503 -0.204620 -0.046638 -0.132851 -0.082064 0.382218 -0.072122 -0.087484 0.092349 -0.123126
polarizability: 3.92536865e+02 1.20566364e-01 1.59397154e+02 4.18978656e-02 -4.06058636e-02 6.12644527e+01
1716.lowfreq: -4.2169 -3.9498 -2.6869 -0.0007 -0.0007 -0.0001 29.6737 41.0583 68.3920
frequency: 29.4266 41.0510 68.3712 79.0553 115.6966 217.6814 223.3883 234.7619 245.3654 341.3864 348.0774 407.4014 434.6094 448.4700 497.4238 501.2980 544.8519 579.1532 580.6077 596.6533 618.6627 630.9093 664.4791 685.8300 692.8116 754.3459 778.6434 785.5392 801.3980 802.5946 833.2097 883.5294 887.9184 918.9971 920.7196 967.6398 980.8644 1001.6884 1016.2082 1024.4341 1064.8729 1095.0483 1113.2816 1115.7530 1182.2338 1192.2206 1219.3517 1246.1159 1279.0682 1298.2815 1306.6652 1325.8742 1358.5095 1364.7133 1391.3792 1403.5674 1424.7165 1447.5740 1463.0922 1534.2050 1547.0470 1590.0534 1611.9123 1616.6417 3133.2594 3138.5291 3148.1070 3169.0726 3173.7926 3184.8692 3188.9921 3589.8385
redmass: 5.6137 7.7723 6.5280 7.1803 7.1183 8.2322 10.3583 6.1866 4.4898 5.7329 5.6877 2.8405 4.1696 8.2856 3.7961 7.8895 5.0265 8.3571 2.0171 1.6555 7.4172 7.2602 4.6570 8.6337 5.0025 4.4248 8.5872 1.6828 3.3746 7.0895 1.4223 1.5167 7.1679 1.3711 8.1363 1.3700 1.3684 3.2289 1.3514 2.4149 3.0902 2.9659 1.5678 1.3653 1.5107 2.3203 4.4292 1.5816 4.4158 2.3118 1.6332 2.7688 5.6944 9.2695 2.1894 9.0718 3.6453 2.7434 2.4042 4.5591 7.1614 7.8582 6.2801 7.1799 1.0898 1.0883 1.0923 1.0900 1.0993 1.0945 1.0967 1.0812
irintensity: 5.6083 1.3171 0.2565 3.2381 5.6710 4.7861 0.0189 0.7445 3.3910 0.7253 1.9442 0.2428 0.0211 5.2523 6.2643 1.0302 5.8524 0.2648 18.7051 60.8109 0.5824 0.3103 32.8217 4.8529 13.7607 0.0659 17.8998 68.2862 22.7229 17.4316 20.2395 46.8222 4.1679 0.0515 0.0175 1.7144 2.1557 1.5460 0.0028 1.4590 2.3681 32.8897 8.5359 18.6614 161.7681 14.1881 532.2430 11.4094 55.4218 29.8453 0.6222 44.1209 1.7338 69.2544 13.1088 18.7217 65.7092 20.2095 3.1984 14.9631 19.1813 2.6517 119.5445 29.9247 16.7057 12.1360 10.6833 0.8506 28.5941 1.1650 1.4412 25.8626
temp: 298.150 k
press: 1.00000 atm
elementType: 8 8 7 7 7 7 6 6 6 6 6 6 6 6 6 6 6 6 1 1 1 1 1 1 1 1
symmnumber: 1
zpe: 485108.4 jmol-1
zpe.correction: 0.184768 hartree
zpe.thermalcorrener: 0.198216 hartree
zpe.thermalcorrenthalpy: 0.199160 hartree
zpe.thermalcorrgfe: 0.142841 hartree
zpe.sumelectzpe: -830.225388 hartree
zpe.sumelectthermal: -830.211941 hartree
zpe.sumelectthermalent: -830.210996 hartree
zpe.sumelectthermalfe: -830.267315 hartree
dipole: 5.5166 5.8095 0.0281
dipole: 8.0115
quadrupole: -124.8559 -97.7821 -105.5913
quadrupole: 14.7700 0.1298 -0.0466
quadrupole: -15.4461 11.6277 3.8185 14.7700 0.1298 -0.0466
hfenergy: -830.4101564 hartree
pointgroup: C01 [X(C12H8N4O2)]
dipole: 2.1532745 -2.3008546 -0.066692 debye
dipolederiv: -0.9168603 0.2050416 -0.0025908 0.43161 -0.6729752 -0.0076909 0.0040038 -0.0106106 -0.2274695 -0.9637512 -0.1916977 -0.0148093 -0.4278433 -0.6505447 -0.0176838 -0.0219799 -0.0147005 -0.232618 -0.3462515 0.0509938 0.0008787 -0.1165842 -0.4574174 -0.0113646 -0.003851 -0.0101476 -0.2621987 -0.2651625 -0.194594 -0.0084686 0.1184692 -0.3564223 -0.0034332 0.0002798 -0.0066874 -0.2527601 0.0135353 -0.0032876 0.0023738 -0.0003453 -0.2748517 -0.0024657 0.0032946 -0.0024973 -0.2202174 2.5332297 -0.034024 0.0282254 -0.0433491 1.0825042 0.0257188 0.0288893 0.0258115 0.192799 -0.0847487 -0.092363 -0.0057059 -0.3269355 0.6268425 0.0207964 -0.0146581 0.021338 0.0824128 0.9509615 0.0263242 0.0115217 0.0321244 0.0873076 0.0012554 0.0118115 0.0015619 0.0459507 -0.1812944 0.1211526 0.001966 0.4032781 -0.1075536 -0.0051074 0.012033 -0.0071781 0.1313391 0.2734452 0.1509395 0.0086282 -0.1534709 0.1016254 0.0001429 -0.0016409 0.0034646 0.0638644 -0.5642874 0.1731018 -0.0003566 0.3211794 -0.0104506 0.0066592 0.0052031 0.0056411 -0.1065552 -0.4725147 -0.1336522 -0.0069643 -0.307931 0.03334 0.0012799 -0.013026 0.003345 -0.1615806 0.4746866 -0.0812073 0.003247 -0.0858629 0.1371825 0.0115809 0.0022937 0.011653 -0.1629371 -1.2671701 0.037994 -0.0149019 -0.0359306 0.0508163 -0.0003251 -0.0181457 0.0004472 0.0496055 0.4520809 -0.156477 0.0021216 0.2197993 -0.0109838 0.0052912 0.0142073 0.0006129 -0.0980794 0.3267609 0.0991773 0.0079534 -0.1634364 -0.0324653 -0.0003356 -0.0004071 0.0028046 -0.091138 -0.3258037 -0.0200915 -0.0036026 -0.6561999 -0.0991739 -0.0066183 -0.0301028 0.0001335 -0.1126914 -0.0432794 0.0354267 0.0019054 0.7599361 0.2348182 0.0221999 0.031806 0.0140663 -0.0926943 0.1921454 -0.0340287 -0.002488 -0.0477886 0.1542721 -0.0078279 -0.0033629 -0.0062223 0.3411069 0.113853 -0.0555106 -0.0020356 -0.0513255 0.057752 -0.0032469 -0.0014659 -0.0036906 0.1522595 0.0263616 0.112572 0.0017103 0.1075709 -0.0530021 -0.0042772 0.0014894 -0.0043892 0.146583 0.0858292 -0.0116469 -0.0012633 0.0500421 -0.0763868 -0.0097758 0.001515 -0.0104607 0.1701525 0.0904412 0.0543925 0.0006098 0.0148075 0.0658938 -0.0028433 -0.0009649 -0.0023354 0.1694879 0.0890064 -0.0557001 -0.0026405 -0.0200052 0.0613526 -0.0034536 -0.0014158 -0.0038648 0.1713605 -0.0886542 0.0698935 0.0003171 0.0746425 0.0664469 -0.0034563 0.0007062 -0.0034569 0.1665031 -0.1025585 -0.0727288 -0.0056311 -0.0964511 0.0420731 -0.0050192 -0.0065116 -0.0046383 0.1375148 unknown
polarizability: 392.4759361|-1.9969774|159.2939186|3.8413542|3.4012098|61.4286172 unknown
InChI: InChI=1S/C12H8N4O2/c17-16(18)9-5-3-8(4-6-9)11-14-10-2-1-7-13-12(10)15-11/h1-7,14H
charge 0 multiplicity 1
26 atoms
O  -5.536086 1.211924 0.012718
O  -5.586168 -1.069251 -0.055352
N  1.603039 -1.186206 0.016598
N  1.545122 1.100857 0.110713
N  3.984461 1.465256 0.153085
N  -4.955546 0.058598 -0.014211
C  0.80082 -0.026259 0.056201
C  -0.664855 -0.044845 0.037935
C  2.934884 -0.774621 0.049504
C  2.879545 0.668684 0.108285
C  -1.354199 1.201275 0.066553
C  -1.415214 -1.253815 -0.006991
C  4.172017 -1.447092 0.033346
C  -3.474653 0.025466 0.004248
C  -2.756888 1.243031 0.049772
C  -2.82032 -1.225453 -0.024058
C  5.312131 -0.616491 0.079724
C  5.173257 0.803986 0.137972
H  1.271202 -2.148084 -0.022654
H  -0.758533 2.117884 0.101707
H  -0.916369 -2.229522 -0.027887
H  4.257361 -2.537441 -0.011712
H  -3.303953 2.188911 0.070717
H  -3.41576 -2.141262 -0.058294
H  6.315909 -1.051865 0.07139
H  6.067497 1.435937 0.17379
