program: Gaussian 09
title: 000152023
version: EM64L-G09RevD.01
frameworkgroup: C1[X(C20H10O3)]
method: RPBEPBE
basis: SDD
operation: Freq
keyword: #pfreq=noraman
keyword: PBEPBE/SDD
title: #p freq=noraman PBEPBE/SDD
converged: YES YES NO NO
title: Mulliken charges:
elementType: O O O C C C C C C C C C C C C C C C C C C C C H H H H H H H H H H
charge: -0.270413 -0.458563 -0.396477 0.157535 0.024024 0.337388 -0.025036 0.454686 0.007107 0.531539 0.072839 -0.827646 0.477421 0.474166 -0.170068 -0.456627 0.037359 -0.515399 -0.494350 -0.482324 -0.462585 -0.463918 -0.241770 0.218903 0.257594 0.239653 0.242775 0.239329 0.246978 0.243392 0.230153 0.382706 0.389629
chargesum: 0.00000
title: Mulliken charges with hydrogens summed into heavy atoms:
elementType: O O O C C C C C C C C C C C C C C C C C C C C
charge: -0.270413 -0.075856 -0.006848 0.157535 0.024024 0.337388 -0.025036 0.454686 0.007107 0.531539 0.072839 -0.608743 0.477421 0.474166 -0.170068 -0.199034 0.037359 -0.275746 -0.251575 -0.242995 -0.215607 -0.220526 -0.011617
polarizability: 4.87371899e+02 9.85482580e-01 2.60091354e+02 -4.49225778e+00 1.72971494e+00 8.52375278e+01
1716.lowfreq: -10.0944 -0.8462 0.0001 0.0006 0.0007 5.3398 48.6339 62.0958 104.0848
frequency: 48.6254 62.0868 104.0835 118.5883 138.6996 156.2619 179.4965 198.1973 217.6893 227.0101 263.2302 276.9135 280.5776 319.6428 343.2577 366.9942 406.5099 437.3291 443.2344 463.7473 471.3181 479.9331 496.4876 507.9055 514.4841 530.3677 549.9254 556.9845 570.1876 598.7125 610.5208 664.5385 670.6923 702.6884 711.5928 741.7106 748.9389 771.3376 794.2085 809.7908 814.7322 852.2279 869.4223 871.1091 893.6586 909.2379 919.3351 978.0781 980.7478 987.0571 993.6214 1009.7912 1068.3253 1106.6673 1118.7448 1143.3501 1149.3897 1176.3747 1193.5204 1219.3493 1228.6374 1236.7846 1255.4565 1259.7290 1325.9274 1349.1869 1361.0958 1390.8121 1398.2244 1417.9588 1424.9046 1436.8455 1443.1257 1461.7989 1486.9027 1496.8361 1529.2856 1541.1690 1582.3456 1599.5690 1602.6307 1629.8232 1800.8914 3090.4131 3119.0931 3125.6457 3128.5674 3134.8142 3144.4249 3151.8242 3159.4993 3514.6653 3602.8087
redmass: 6.5992 5.9968 8.1901 7.5406 6.6959 4.4939 4.8047 4.8914 2.6042 2.2025 6.7091 3.2817 5.9278 6.0996 6.9550 7.3645 4.0097 5.5081 6.0830 5.7370 3.5708 1.4853 4.4328 4.3356 5.9097 4.4918 4.0380 4.5676 6.8172 6.2374 7.9159 5.6475 5.4693 3.8354 7.1624 6.8044 2.9702 1.2601 5.9194 1.6136 3.9580 1.7217 5.9794 3.3714 2.4120 5.9957 1.4755 1.3639 4.9817 1.4133 1.4218 3.8156 2.5240 2.8658 2.5125 1.6482 1.5560 1.2576 1.2625 1.7872 2.8379 1.8056 1.8856 1.7633 3.8357 2.9593 4.3282 3.4790 3.2681 4.2550 3.5714 4.2101 3.4228 4.7725 5.7630 4.2189 5.6780 6.3219 6.1996 6.7275 6.4613 7.3505 11.7753 1.0898 1.0861 1.0863 1.0870 1.0918 1.0981 1.0979 1.0990 1.0647 1.0660
irintensity: 0.6800 4.8243 2.2592 0.4792 4.8813 14.3897 4.9593 3.9078 34.8715 91.4420 2.8568 9.7694 2.2218 14.9281 19.1422 1.6507 6.1623 9.0751 1.5560 11.6859 28.7314 112.4227 7.2042 0.8775 5.0771 0.3479 1.0296 8.4546 13.7809 0.9571 52.7391 0.1088 3.4433 11.7202 22.1671 13.8761 40.2998 5.7306 19.3725 2.8635 7.9484 0.1543 75.8644 45.9900 95.5112 18.9477 2.2614 1.8724 0.5945 0.1075 1.3380 5.6078 40.1857 40.8277 14.9870 91.7315 11.1475 1.7578 43.3480 467.8707 54.9289 76.8070 2.4721 104.7599 73.0395 25.3161 17.0741 46.3595 24.2022 4.7470 8.2505 15.9431 33.5970 29.4890 39.3631 24.8694 5.9078 69.2593 2.3173 0.6480 3.9418 0.2568 59.8144 13.9253 1.3352 0.8141 1.4434 11.6598 35.6715 11.9929 46.6057 125.5959 29.8669
temp: 298.150 k
press: 1.00000 atm
elementType: 8 8 8 6 6 6 6 6 6 6 6 6 6 6 6 6 6 6 6 6 6 6 6 1 1 1 1 1 1 1 1 1 1
symmnumber: 1
zpe: 617517.9 jmol-1
zpe.correction: 0.235200 hartree
zpe.thermalcorrener: 0.252245 hartree
zpe.thermalcorrenthalpy: 0.253189 hartree
zpe.thermalcorrgfe: 0.191495 hartree
zpe.sumelectzpe: -992.184709 hartree
zpe.sumelectthermal: -992.167664 hartree
zpe.sumelectthermalent: -992.166720 hartree
zpe.sumelectthermalfe: -992.228414 hartree
dipole: -3.7127 4.5580 0.6838
dipole: 5.9183
quadrupole: -127.4312 -116.1425 -137.2171
quadrupole: 17.9985 1.8326 2.2583
quadrupole: -0.5009 10.7878 -10.2868 17.9985 1.8326 2.2583
hfenergy: -992.4199094 hartree
pointgroup: C01 [X(C20H10O3)]
dipole: 1.4777906 -1.7716531 0.3147769 debye
polarizability: 487.2951089|3.4136325|259.9643752|5.7498219|-5.6992228|85.4412972 unknown
InChI: InChI=1S/C20H10O3/c21-17-13-8-11-5-4-9-2-1-3-10-6-7-12(15(11)14(9)10)16(13)19-20(23-19)18(17)22/h1-8,21-22H
charge 0 multiplicity 1
33 atoms
O  -3.358864 2.727438 0.029415
O  -3.875334 -2.281726 0.141134
O  -5.647239 -0.220073 0.253047
C  -1.371788 0.623475 -0.186295
C  0.950136 -0.221412 -0.059915
C  0.043743 0.882562 -0.12267
C  -2.425517 1.524996 -0.366612
C  -1.893414 -0.756359 -0.122005
C  2.366087 0.016917 -0.000756
C  0.442454 -1.586812 -0.082932
C  -3.742797 1.276312 -0.2902
C  -0.944602 -1.824705 -0.119671
C  2.869795 1.368432 0.008144
C  3.289173 -1.091194 0.041156
C  -3.313312 -0.993569 -0.012179
C  0.56277 2.224012 -0.130501
C  -4.308207 0.034163 0.000361
C  1.398548 -2.677488 -0.055486
C  1.929055 2.458686 -0.060644
C  2.757244 -2.441574 0.009137
C  4.278593 1.585251 0.072279
C  4.680701 -0.831754 0.103343
C  5.168909 0.497755 0.121433
H  -1.27783 -2.871019 -0.165921
H  -0.143023 3.059633 -0.191676
H  1.016303 -3.704951 -0.080518
H  2.31393 3.484968 -0.063984
H  3.464479 -3.278782 0.036026
H  4.660364 2.612593 0.08038
H  5.382614 -1.673244 0.134839
H  6.248029 0.678123 0.170574
H  -3.210522 -2.948153 0.439791
H  -5.766778 -1.2001 0.372606
