program: Gaussian 09
title: 000152001
version: EM64L-G09RevD.01
frameworkgroup: C1[X(C20H24O9S)]
method: RPBEPBE
basis: SDD
operation: Freq
keyword: #p
keyword: freq=noraman
keyword: PBEPBE/SDD
title: #p freq=noraman PBEPBE/SDD
converged: YES YES NO NO
title: Mulliken charges:
elementType: S O O O O O O O O O C C C C C C C C C C C C C C C C C C C C H H H H H H H H H H H H H H H H H H H H H H H H
charge: 1.035845 -0.251808 -0.571208 -0.515435 -0.512114 -0.337909 -0.396955 -0.441873 -0.238973 -0.413899 -0.317279 -0.395696 -0.601740 -0.304121 -0.562294 -0.475454 0.006566 0.564375 0.226983 0.428509 0.226229 0.246882 -0.582850 -0.591886 -0.572888 -0.468297 0.184038 -0.330981 0.189807 -0.538737 0.237206 0.231083 0.228509 0.229850 0.296195 0.294208 0.213869 0.213210 0.228931 0.227554 0.260328 0.263735 0.281890 0.240076 0.225448 0.232876 0.239476 0.383865 0.381866 0.368620 0.351507 0.246698 0.216975 0.219189
chargesum: 0.00000
title: Mulliken charges with hydrogens summed into heavy atoms:
elementType: S O O O O O O O O O C C C C C C C C C C C C C C C C C C C C
charge: 1.035845 -0.251808 -0.187343 -0.515435 -0.512114 -0.337909 -0.015088 -0.073254 -0.238973 -0.062392 0.151010 0.062663 -0.011337 0.122958 -0.105809 0.048609 0.006566 0.564375 0.226983 0.428509 0.226229 0.246882 -0.300960 -0.351810 -0.347440 -0.235420 0.184038 -0.091504 0.189807 0.144124
polarizability: 4.09389504e+02 2.40182739e+01 2.84312680e+02 6.48634372e+00 -5.14293680e-01 2.06517348e+02
1716.lowfreq: -2.6628 -0.4371 -0.0010 0.0008 0.0018 3.8368 10.7918 11.5968 16.1006
frequency: 10.6644 11.4032 16.0727 17.4712 19.8551 30.9043 34.2731 45.7545 75.6123 77.8081 93.1737 109.3691 117.0971 122.9980 124.5831 128.0011 145.6392 152.9632 180.4482 185.4710 196.9714 207.7188 212.8413 232.0235 237.2234 241.7775 272.1544 274.7249 280.1070 292.2074 301.5911 308.6812 331.7253 337.7767 348.0489 361.2328 380.4680 391.7661 397.0916 421.8815 429.5378 450.3810 471.0451 480.2450 506.2736 519.5133 549.9375 555.1218 563.6476 580.3359 595.0981 600.3948 609.5958 627.4886 629.6689 663.4449 706.1547 720.0803 726.0295 731.3539 763.7898 775.0225 784.4401 790.7173 805.6073 811.1690 845.0181 848.6619 856.8677 907.7886 917.0509 923.7591 944.1984 961.3835 970.0498 985.8660 1003.1787 1013.9071 1015.5093 1025.0191 1028.2369 1045.4749 1054.3484 1065.9570 1088.5004 1088.6680 1100.3491 1111.9285 1136.3684 1148.2458 1150.4418 1154.1019 1170.5983 1177.2100 1179.4063 1219.0386 1227.2935 1229.9568 1237.7997 1244.9894 1263.9530 1280.7629 1283.5932 1292.6273 1293.0579 1302.2871 1303.3270 1311.4349 1346.1936 1362.2119 1377.4423 1387.7576 1397.4732 1398.3620 1413.6517 1416.2481 1419.8427 1424.7017 1436.5143 1466.4036 1468.6844 1472.3058 1472.5953 1479.5210 1490.9140 1496.0790 1516.6596 1553.5389 1583.1125 1596.9632 1622.4853 1650.4601 2558.9500 2953.7909 2953.9267 2992.4534 2994.8388 3007.9876 3009.9237 3013.8345 3035.1895 3039.3386 3047.2877 3059.3706 3069.8109 3077.2173 3095.4076 3124.0449 3128.8485 3144.6909 3151.3959 3162.3315 3197.1110 3499.8655 3569.9594 3572.3965
redmass: 6.7245 6.9659 6.7558 5.9732 6.0087 5.0983 6.2188 5.2589 4.4250 3.1350 5.5680 2.5978 6.7941 3.4877 4.3985 2.4871 2.7169 5.0683 1.9838 4.2519 4.5020 6.4599 4.2062 4.6293 1.2824 1.9610 3.5002 4.7505 4.2695 4.4471 4.6212 5.4096 5.0667 4.8253 3.8083 1.3189 1.1742 4.8583 7.1468 5.0126 4.8599 3.2498 7.1072 6.4430 4.3403 7.0320 2.7536 14.8179 6.5239 5.4004 3.3202 5.9291 4.8991 4.1850 2.8520 5.3842 5.7173 2.3294 3.3406 5.4198 1.1012 1.7154 2.0590 1.9934 1.2101 1.9734 11.9157 1.7386 1.7771 1.5560 1.4924 5.6049 3.2006 2.9576 5.7226 8.1664 2.0941 3.2064 1.0658 1.9431 3.5255 3.4046 2.2749 3.4698 2.2479 1.4563 2.8747 1.2611 1.3504 1.2538 2.3749 1.2491 1.1913 1.4150 1.5393 1.5905 2.5864 1.8068 1.3110 1.2064 1.1994 2.2295 2.7795 1.1240 1.4278 1.2641 1.0913 2.5335 2.3247 1.4626 2.2881 1.7717 4.6335 2.5112 1.9745 1.1100 4.2413 2.2408 1.1767 1.0503 1.0944 1.0632 1.0810 1.1041 1.2204 2.6645 2.9022 3.7709 2.9911 6.7869 6.8414 4.8730 1.0750 1.0539 1.0342 1.0595 1.0626 1.0589 1.0607 1.1068 1.0959 1.1036 1.1037 1.0562 1.1019 1.1056 1.0908 1.0985 1.0892 1.0909 1.1109 1.0940 1.0929 1.0665 1.0658 1.0659
irintensity: 0.1121 0.5347 0.2749 1.0857 2.3969 2.2287 1.7223 0.3333 5.0235 0.2135 0.2855 0.1119 2.5590 1.1160 4.7830 0.2442 3.2792 0.5934 31.5830 4.8107 3.2181 0.5440 3.8227 0.6325 0.9297 44.7133 6.5459 34.8930 8.8113 7.3183 64.6920 12.4959 12.4896 26.6987 13.5297 76.0861 91.8128 47.0526 33.4960 4.7019 9.7985 13.1716 0.9183 13.1560 5.8916 9.1196 1.8691 162.8676 20.1219 13.8246 2.5600 4.7046 5.9051 9.5142 12.1506 28.1382 2.8990 18.6014 6.3590 14.2559 11.7505 8.7520 3.5633 21.6524 0.0758 15.9268 44.6350 24.5276 55.5253 18.6430 2.7318 10.1582 12.3518 69.4358 81.4796 35.3400 10.5789 78.7974 118.2402 66.4773 49.7472 28.0873 32.1337 12.7233 150.5208 56.1252 6.1928 0.2037 15.6086 3.6118 452.0596 6.9451 47.3839 94.4117 23.9587 206.8341 153.5101 135.4948 1.1458 4.3129 10.9125 84.0169 66.5240 1.5954 20.1635 5.2403 0.1716 157.9749 81.8814 5.8589 66.8290 23.7410 6.0311 58.7381 61.9595 9.2318 50.0895 117.0813 10.4090 12.7898 16.6137 50.9924 5.9121 19.0804 13.8102 143.6938 142.4344 127.7894 209.2025 35.1405 8.6893 809.5760 585.8386 24.8316 79.5923 3.3604 19.2405 21.9483 16.4231 21.3945 0.6960 52.6468 0.0821 3.9530 15.0929 37.9888 19.0524 30.7356 8.3536 7.0605 0.4820 13.4779 0.3184 58.5424 39.9342 29.6459
temp: 298.150 k
press: 1.00000 atm
elementType: 16 8 8 8 8 8 8 8 8 8 6 6 6 6 6 6 6 6 6 6 6 6 6 6 6 6 6 6 6 6 1 1 1 1 1 1 1 1 1 1 1 1 1 1 1 1 1 1 1 1 1 1 1 1
symmnumber: 1
zpe: 1078385.5 jmol-1
zpe.correction: 0.410735 hartree
zpe.thermalcorrener: 0.442780 hartree
zpe.thermalcorrenthalpy: 0.443724 hartree
zpe.thermalcorrgfe: 0.340926 hartree
zpe.sumelectzpe: -1849.152562 hartree
zpe.sumelectthermal: -1849.120517 hartree
zpe.sumelectthermalent: -1849.119573 hartree
zpe.sumelectthermalfe: -1849.222371 hartree
dipole: 2.3015 -2.1863 -0.8985
dipole: 3.2991
quadrupole: -193.0204 -215.2371 -179.6544
quadrupole: 24.0846 11.7857 9.0050
quadrupole: 2.9502 -19.2664 16.3162 24.0846 11.7857 9.0050
hfenergy: -1849.563297 hartree
pointgroup: C01 [X(C20H24O9S1)]
dipole: 0.886704 -0.8969565 -0.3065645 debye
polarizability: 410.3453865|20.5810103|282.896195|10.1571828|-2.6788498|206.9779514 unknown
InChI: InChI=1S/C20H24O9S/c1-28-19-7-5-13(10-16(19)22)4-6-15(21)20-17(23)11-14(12-18(20)24)29-8-2-3-9-30(25,26)27/h5,7,10-12,22-25H,2-4,6,8-9H2,1H3
charge 0 multiplicity 1
54 atoms
S  9.253903 -2.219755 0.342689
O  3.792586 1.483001 0.202863
O  10.879618 -1.353921 0.066232
O  8.862308 -3.103254 -0.954865
O  9.239647 -2.910775 1.806002
O  -2.321751 3.309226 -0.172653
O  -0.044781 4.258973 -0.091511
O  -0.662334 -0.581678 0.07398
O  -8.17573 -2.860123 0.066024
O  -7.23475 -1.755615 2.319465
C  6.766017 -0.875846 0.330673
C  5.955533 0.44443 0.296716
C  8.263474 -0.56991 0.3478
C  4.449339 0.16552 0.260099
C  -4.390097 1.503277 -0.241081
C  -2.940571 0.974076 -0.116091
C  -0.451843 1.835969 -0.01712
C  -5.40436 0.369954 -0.20001
C  -1.899155 2.080946 -0.103331
C  2.397999 1.536986 0.134845
C  0.448726 2.98532 -0.016507
C  0.169775 0.548602 0.066097
C  1.846954 2.827996 0.058812
C  1.565951 0.383209 0.140407
C  -5.85116 -0.152614 1.04248
C  -5.907712 -0.21366 -1.383525
C  -6.767478 -1.221361 1.107353
C  -6.827457 -1.289087 -1.33459
C  -7.267078 -1.806079 -0.095236
C  -8.715867 -3.46177 -1.15364
H  6.524642 -1.490218 -0.558127
H  6.491863 -1.464445 1.227731
H  6.225796 1.040643 -0.594864
H  6.182558 1.06255 1.185133
H  8.629664 -0.060661 -0.557188
H  8.621263 -0.069714 1.261086
H  4.177755 -0.429593 -0.636241
H  4.12206 -0.379458 1.169628
H  -4.485173 2.071198 -1.183849
H  -4.578047 2.229375 0.570777
H  -2.823864 0.361668 0.799138
H  -2.709775 0.267734 -0.936166
H  2.490244 3.709471 0.055005
H  1.989643 -0.624459 0.20308
H  -5.484013 0.293072 1.978563
H  -5.588384 0.176127 -2.357082
H  -7.203066 -1.715021 -2.269836
H  11.607368 -2.039314 0.084494
H  -1.091263 4.168502 -0.141522
H  -0.126171 -1.41191 0.132068
H  -6.839379 -1.261325 3.080653
H  -9.400555 -4.247824 -0.803078
H  -7.914787 -3.912743 -1.772394
H  -9.275884 -2.720391 -1.757288
