program: Gaussian 09
title: 000151998
version: EM64L-G09RevD.01
frameworkgroup: C1[X(C18H11NO2)]
method: RPBEPBE
basis: SDD
operation: Freq
keyword: #p
keyword: freq=noraman
keyword: PBEPBE/SDD
title: #p freq=noraman PBEPBE/SDD
converged: NO YES YES YES
title: Mulliken charges:
elementType: O O N C C C C C C C C C C C C C C C C C C H H H H H H H H H H H
charge: -0.209125 -0.213990 0.019474 0.266367 0.271322 0.214407 0.172287 0.463353 0.438050 -0.423287 -0.419068 -0.519373 -0.514424 -0.504106 -0.347122 -0.421189 0.381906 -0.436066 -0.418597 -0.257147 -0.247511 0.227574 0.232289 0.246210 0.241718 0.279401 0.253518 0.222148 0.246969 0.288342 0.231572 0.234099
chargesum: 0.00000
title: Mulliken charges with hydrogens summed into heavy atoms:
elementType: O O N C C C C C C C C C C C C C C C C C C
charge: -0.209125 -0.213990 0.019474 0.266367 0.271322 0.214407 0.172287 0.463353 0.438050 -0.195714 -0.186779 -0.273163 -0.272706 -0.224706 -0.124974 -0.167671 0.381906 -0.189098 -0.130255 -0.025574 -0.013412
polarizability: 4.37106023e+02 -7.59275845e+00 2.29173294e+02 4.93863231e-03 -7.10981828e-04 7.65676140e+01
1716.lowfreq: -9.4591 -0.0013 -0.0002 0.0009 4.9930 8.3543 39.2112 53.7204 82.9376
frequency: 39.1997 53.7162 82.9374 112.3033 112.4037 159.1488 200.6404 217.0352 269.1319 270.0693 299.3462 350.5625 383.9320 392.4684 434.8279 463.6309 485.8400 495.1718 515.8781 531.9894 550.8926 567.0821 569.2832 579.9375 614.8398 676.9317 678.3145 686.2828 709.1803 745.3454 754.0279 768.1564 790.0878 800.0851 829.0892 851.3655 857.4966 872.6961 876.9743 891.3077 914.9001 940.2912 959.5212 977.5972 985.2830 996.1790 997.6878 1022.8541 1040.0220 1076.1296 1098.6341 1141.6421 1155.4928 1177.9991 1186.6133 1208.5766 1232.6061 1243.8117 1245.4011 1261.7142 1271.9705 1293.1623 1341.2804 1363.1926 1390.7616 1406.0663 1412.5360 1421.4971 1434.6814 1446.7409 1448.6297 1492.4954 1526.2647 1532.8252 1577.6241 1602.6414 1611.3382 1621.0612 1628.3078 3126.6875 3131.8024 3133.4439 3137.9051 3141.6995 3153.8293 3165.1583 3165.6167 3172.2148 3189.3440 3190.8791
redmass: 6.0025 10.4003 5.2005 8.5798 4.4048 4.3785 4.3748 6.4349 4.3455 8.8935 4.4842 7.9213 5.9040 3.1627 2.9859 5.9917 3.6320 5.8889 3.0899 5.7239 6.9235 7.6392 4.3800 2.7376 7.9896 5.8726 4.2562 6.9666 4.0741 8.0127 1.6926 1.6416 7.2261 1.5912 1.4333 5.6849 2.2459 3.8616 1.7895 1.9710 5.9137 1.6479 1.3847 1.3690 1.3880 1.3848 1.3724 3.8741 2.1864 2.8503 2.7577 1.4109 1.3186 1.1106 1.2961 7.3589 2.2748 1.6539 1.6740 1.8010 1.9848 1.7749 2.9558 8.3884 3.9141 4.8589 2.8821 5.9637 3.6294 2.4731 2.3530 3.2172 5.2930 3.6412 8.7041 6.4036 6.3584 6.9004 6.4918 1.0865 1.0884 1.0882 1.0891 1.0904 1.0948 1.0966 1.0971 1.0953 1.0907 1.0943
irintensity: 0.3439 0.1082 1.5548 1.3878 0.3207 0.0054 0.7420 0.7480 7.8477 0.7249 0.8703 0.2256 0.0138 0.2536 13.8955 7.1681 0.3630 2.6251 0.0102 4.6972 0.4565 3.1874 1.3081 5.9134 5.9171 6.0885 2.7153 7.4606 9.9801 15.3554 2.6639 84.4043 8.3684 7.6023 10.1877 1.1169 9.4494 0.0057 83.2021 9.6436 5.5870 21.5471 5.8195 0.9173 0.1454 0.3376 0.1369 5.0504 3.1945 14.7666 23.0768 3.0112 20.8388 3.0984 8.6375 568.0961 4.0323 10.2613 10.0819 3.9877 25.3582 3.8062 2.4582 99.5730 9.1759 1.3086 52.4650 0.8186 29.3454 0.4012 8.7468 7.5616 0.7409 2.7149 0.6552 7.0800 4.6871 42.7081 0.5246 1.6704 5.1794 0.3994 10.3291 14.3020 16.5042 12.2063 25.5531 35.5985 0.3577 3.0841
temp: 298.150 k
press: 1.00000 atm
elementType: 8 8 7 6 6 6 6 6 6 6 6 6 6 6 6 6 6 6 6 6 6 1 1 1 1 1 1 1 1 1 1 1
symmnumber: 1
zpe: 627646.0 jmol-1
zpe.correction: 0.239058 hartree
zpe.thermalcorrener: 0.254066 hartree
zpe.thermalcorrenthalpy: 0.255010 hartree
zpe.thermalcorrgfe: 0.196410 hartree
zpe.sumelectzpe: -896.273945 hartree
zpe.sumelectthermal: -896.258937 hartree
zpe.sumelectthermalent: -896.257993 hartree
zpe.sumelectthermalfe: -896.316593 hartree
dipole: 6.0583 3.0893 0.0008
dipole: 6.8005
quadrupole: -133.5344 -106.5557 -126.2243
quadrupole: -15.0086 -0.0046 -0.0023
quadrupole: -11.4296 15.5491 -4.1195 -15.0086 -0.0046 -0.0023
hfenergy: -896.5130027 hartree
pointgroup: C01 [X(C18H11N1O2)]
dipole: -2.3683291 1.2447933 -0.0003277 debye
polarizability: 437.2619648|5.0199836|229.0173519|0.004947|0.0006499|76.567614 unknown
InChI: InChI=1S/C18H11NO2/c20-19(21)14-8-5-13-7-9-16-15-4-2-1-3-12(15)6-10-17(16)18(13)11-14/h1-11H
charge 0 multiplicity 1
32 atoms
O  5.838815 -0.669117 0.000283
O  4.364354 -2.409647 0.00032
N  4.636577 -1.144979 -0.000119
C  -0.291326 -0.249752 -0.000069
C  -1.361085 0.707214 -0.000033
C  1.095939 0.215156 -0.000064
C  -2.750545 0.250897 -0.000039
C  1.374193 1.634616 -0.000021
C  -3.024307 -1.166983 -0.000079
C  -1.034165 2.111579 0.000012
C  -0.611785 -1.654909 -0.000109
C  0.277089 2.560623 0.000017
C  -1.924518 -2.094946 -0.000113
C  2.203881 -0.681116 -0.000096
C  -3.868042 1.145596 -0.000008
C  2.72867 2.099871 -0.000016
C  3.511555 -0.182308 -0.000096
C  -4.375794 -1.63483 -0.000083
C  3.801804 1.211484 -0.000049
C  -5.184031 0.666944 -0.000014
C  -5.445193 -0.734929 -0.000052
H  -1.838831 2.851651 0.000041
H  0.190603 -2.397253 -0.000137
H  0.493127 3.634799 0.000051
H  -2.144562 -3.168769 -0.000142
H  2.076446 -1.765295 -0.000124
H  2.91238 3.179885 0.00002
H  -3.708806 2.2276 0.000021
H  -4.559018 -2.715646 -0.000113
H  4.842012 1.544594 -0.000045
H  -6.020065 1.374663 0.000013
H  -6.477871 -1.099293 -0.000055
