program: Gaussian 09
title: 000151994
version: EM64L-G09RevD.01
frameworkgroup: C1[X(C6H10O)]
method: RPBEPBE
basis: SDD
operation: Freq
keyword: #pfreq=noraman
keyword: PBEPBE/SDD
title: #p freq=noraman PBEPBE/SDD
converged: YES YES NO NO
title: Mulliken charges:
elementType: O C C C C C C H H H H H H H H H H
charge: -0.253630 -0.199517 -0.167979 -0.218270 -0.740350 -0.124960 -0.515642 0.212055 0.212444 0.240394 0.222280 0.218544 0.222081 0.210620 0.244752 0.217477 0.219700
chargesum: 0.00000
title: Mulliken charges with hydrogens summed into heavy atoms:
elementType: O C C C C C C
charge: -0.253630 0.012538 0.044465 0.022124 -0.077444 0.085660 0.166287
polarizability: 1.49219615e+02 -1.03300597e+01 5.81692154e+01 1.70977017e-01 -2.20730627e-01 4.08107068e+01
1716.lowfreq: -3.9469 -0.0006 -0.0005 0.0003 6.6997 26.2574 46.2054 98.4346 104.6579
frequency: 43.6079 98.4334 104.6572 154.6009 180.5589 238.5895 265.1058 350.1434 356.1234 448.3432 562.2630 773.8609 833.1806 907.2439 909.0143 948.9517 983.5916 1037.8917 1076.4589 1110.3481 1114.4192 1175.4439 1186.5958 1234.7380 1288.5707 1298.8174 1328.3136 1394.3328 1436.7595 1459.9524 1464.7077 1467.1288 1472.2625 1636.3858 1676.7723 2954.9821 2956.9372 3026.2330 3042.5234 3066.2632 3071.2365 3077.2605 3092.8615 3122.5758 3122.9064
redmass: 1.9646 2.2363 3.2191 1.2910 1.3595 2.0106 3.0828 3.3500 4.2711 3.3199 3.0936 1.5029 1.7949 2.7396 1.1773 2.1578 1.0842 1.4977 2.9773 1.2567 1.9152 1.8501 2.4721 1.3900 1.4998 1.2685 1.3238 1.2346 1.1561 1.0476 1.0502 1.0502 1.0637 5.4643 5.6401 1.0333 1.0363 1.0968 1.1041 1.0950 1.0922 1.0927 1.0911 1.0943 1.0945
irintensity: 2.9477 1.0605 0.7456 0.1767 2.4345 0.0714 7.2714 4.7868 0.1309 9.0547 0.0367 7.5002 0.2263 11.8518 13.5925 45.2418 121.8314 2.4061 112.9840 2.3141 83.7526 155.5958 80.2406 28.5879 4.4872 4.5831 0.5286 5.7527 3.5265 14.1170 13.3562 37.2259 18.3024 70.7095 77.6420 163.5462 24.9342 31.4082 59.4195 10.6216 1.9224 28.2478 63.1834 0.3197 47.8406
temp: 298.150 k
press: 1.00000 atm
elementType: 8 6 6 6 6 6 6 1 1 1 1 1 1 1 1 1 1
symmnumber: 1
zpe: 374143.7 jmol-1
zpe.correction: 0.142504 hartree
zpe.thermalcorrener: 0.151583 hartree
zpe.thermalcorrenthalpy: 0.152527 hartree
zpe.thermalcorrgfe: 0.108404 hartree
zpe.sumelectzpe: -309.248282 hartree
zpe.sumelectthermal: -309.239203 hartree
zpe.sumelectthermalent: -309.238259 hartree
zpe.sumelectthermalfe: -309.282381 hartree
dipole: -1.1283 1.7604 0.0510
dipole: 2.0916
quadrupole: -32.3133 -40.9478 -46.6784
quadrupole: -4.8277 -0.1380 -0.1170
quadrupole: 7.6665 -0.9679 -6.6986 -4.8277 -0.1380 -0.1170
hfenergy: -309.3907858 hartree
pointgroup: C01 [X(C6H10O1)]
dipole: 0.4359259 0.6831995 0.1426179 debye
dipolederiv: -2.1862492 -0.2522454 -0.0061104 0.5696869 -0.2993771 -0.018282 0.1771886 0.0000494 -0.3010402 0.336471 0.0229728 -0.0070232 -0.173247 0.073237 0.0776286 -0.060052 0.0717848 -0.1731221 0.056705 -0.0218649 -0.0140917 -0.1088539 0.1262267 0.115332 -0.0403723 0.1122195 -0.2573264 -0.504359 -0.0132391 0.0064642 -0.1746034 0.0199351 0.0576485 -0.0326281 0.0559802 -0.1639187 -0.1626373 0.0490833 0.0201069 -0.0637381 0.0318562 -0.0199922 -0.0068661 -0.0224153 0.106171 1.5437678 0.0606404 -0.0258747 -0.6413888 0.184821 0.1150712 -0.1872516 0.0953959 -0.1138096 1.0112577 0.2047373 0.0212216 0.49639 0.3536852 -0.016539 0.0989701 -0.005283 0.3516058 0.0396152 -0.0072217 0.0009408 0.0593662 -0.124753 -0.0803364 0.0187407 -0.0781554 0.1424809 0.0259574 0.0432127 0.0151053 0.0424642 -0.1385274 -0.0859629 0.0151942 -0.0859784 0.151066 0.0552498 -0.0126731 -0.0001564 0.0585921 -0.064313 -0.0705357 0.0192937 -0.0676672 0.1691592 -0.0852129 -0.048093 0.0986968 -0.0044012 0.0466499 0.098935 0.1863937 0.0830125 -0.0269703 0.0659307 -0.0629163 -0.0155119 0.0564943 -0.1484081 -0.0687074 0.0153541 -0.0659479 0.0892194 -0.099154 0.0038727 -0.1086048 0.0836319 0.1078946 -0.0291712 -0.1640241 -0.0097591 -0.0732243 0.0285657 -0.0088554 0.0014734 0.0500158 -0.1122795 -0.0887543 0.0089411 -0.088658 0.1839359 -0.1112578 0.0703941 0.0212084 0.1223941 0.0221779 -0.0222198 0.0323572 -0.021626 0.1143712 -0.0060176 -0.020999 0.0187762 -0.1694664 0.0125667 -0.0976137 -0.115543 -0.1124235 -0.150083 -0.0086322 -0.0068054 -0.0266204 -0.2033366 -0.0913922 0.1334992 0.0343036 0.1394716 -0.0485147 unknown
polarizability: 148.9194545|11.6332762|57.3503359|0.0524478|4.1473366|41.9297471 unknown
InChI: InChI=1S/C6H10O/c1-3-4-5-6-7-2/h3-6H,1-2H3
charge 0 multiplicity 1
17 atoms
O  2.457753 -0.387198 -0.239306
C  -1.243478 0.262674 0.021256
C  -2.451747 -0.365387 -0.119669
C  0.050443 -0.377794 -0.185362
C  -3.796412 0.288374 0.090368
C  1.240455 0.275649 -0.037575
C  3.654971 0.448442 -0.099966
H  -1.23444 1.325856 0.310142
H  -2.460756 -1.428085 -0.407759
H  0.071034 -1.436922 -0.474088
H  -4.37116 -0.217123 0.892273
H  -3.690083 1.352635 0.367668
H  -4.419363 0.235077 -0.824953
H  1.300344 1.337822 0.2485
H  4.509572 -0.225222 -0.261256
H  3.718716 0.89138 0.913669
H  3.669953 1.255122 -0.859042
