program: Gaussian 09
title: 000013602
version: EM64L-G09RevD.01
frameworkgroup: C1[X(C6H7NO)]
method: RPBEPBE
basis: SDD
operation: Freq
keyword: #pfreq=noraman
keyword: PBEPBE/SDD
title: #p freq=noraman PBEPBE/SDD
converged: NO NO NO YES
title: Mulliken charges:
elementType: O N C C C C C C H H H H H H H
charge: -0.352823 -0.018963 0.346381 -0.327919 -0.747677 -0.245046 -0.208609 -0.167881 0.237297 0.258114 0.258123 0.212192 0.278869 0.244346 0.233595
chargesum: 0.00000
title: Mulliken charges with hydrogens summed into heavy atoms:
elementType: O N C C C C C C
charge: -0.352823 -0.018963 0.346381 -0.090622 -0.019247 0.033823 0.035737 0.065714
polarizability: 1.02494883e+02 6.47476198e+00 8.64509573e+01 6.72810499e-03 5.08729021e-03 3.46818947e+01
1716.lowfreq: -2.1209 0.0008 0.0009 0.0009 6.9835 7.7965 158.3133 172.7845 251.1109
frequency: 158.3029 172.7758 251.1086 315.0456 444.6167 452.6599 532.8554 538.4557 584.6441 697.4793 748.5089 760.9469 840.0163 847.6068 928.8901 965.7354 984.3040 1040.7432 1046.1866 1102.8926 1156.1887 1221.5225 1239.8323 1266.0722 1299.9927 1398.4738 1409.2468 1438.7805 1462.5491 1494.0994 1538.4361 1624.2421 2987.9498 3061.8907 3111.0663 3150.5585 3158.7254 3181.7911 3208.8572
redmass: 1.8491 1.4651 3.6930 3.0581 2.8920 5.3484 3.5219 5.9981 6.6380 2.5754 4.8608 1.4529 4.6718 1.3334 1.3545 1.3046 1.6916 2.0747 1.5155 1.6789 1.0930 2.4971 6.3040 3.1024 1.8201 1.6215 1.3578 1.0447 1.2550 2.4143 7.0172 5.8176 1.0370 1.0958 1.1004 1.0875 1.0915 1.0983 1.0970
irintensity: 2.0731 4.1503 0.3346 6.8305 7.0079 5.5471 0.0874 2.3059 0.5515 10.7976 0.3765 94.3811 13.0791 2.9322 2.3280 0.0082 6.6812 8.9844 8.2290 12.3776 1.9624 13.2325 82.6456 4.3496 2.6065 35.8113 13.6521 13.9149 37.0678 15.3755 1.0066 9.3502 12.4564 9.6529 12.8527 1.6448 13.3465 9.1662 0.8219
temp: 298.150 k
press: 1.00000 atm
elementType: 8 7 6 6 6 6 6 6 1 1 1 1 1 1 1
symmnumber: 1
zpe: 309976.7 jmol-1
zpe.correction: 0.118064 hartree
zpe.thermalcorrener: 0.124874 hartree
zpe.thermalcorrenthalpy: 0.125819 hartree
zpe.thermalcorrgfe: 0.087300 hartree
zpe.sumelectzpe: -362.178691 hartree
zpe.sumelectthermal: -362.171880 hartree
zpe.sumelectthermalent: -362.170936 hartree
zpe.sumelectthermalfe: -362.209455 hartree
dipole: -2.6143 -2.5996 -0.0005
dipole: 3.6868
quadrupole: -44.1236 -45.2347 -49.5355
quadrupole: -6.5770 -0.0005 -0.0005
quadrupole: 2.1743 1.0632 -3.2375 -6.5770 -0.0005 -0.0005
hfenergy: -362.2967548 hartree
pointgroup: C01 [X(C6H7N1O1)]
dipole: -1.0976785 0.94819 0.0002078 debye
dipolederiv: -0.8439107 0.3220863 0.0000393 0.3639959 -0.590757 -0.0000366 0.0001806 -0.0001233 -0.3286654 0.6401639 -0.4677458 -0.0000915 -0.6043296 0.3019958 0.0000742 -0.0002047 0.0001528 0.1136439 0.3319474 0.2379111 0.0000028 0.4628586 -0.1021492 -0.0000782 0.0000221 -0.0000272 -0.0215815 0.0322147 -0.0694214 -0.0000233 -0.0476569 0.1171166 0.0000152 -0.0000094 0.0000236 -0.1220497 -0.2255922 -0.1141554 0.0000149 -0.000708 0.1351034 0.0000043 0.000004 -0.00001 0.0433107 -0.1873164 0.1684877 0.0000464 -0.1173542 0.1192741 0.0000452 0.0000052 0.0000023 -0.1533119 -0.1024581 -0.032806 -0.0000008 -0.0824344 -0.0939131 0.0000083 0.0000033 -0.0000035 -0.1847734 0.0818119 -0.0314214 -0.0000135 0.0706775 0.084995 0.000009 -0.0000164 0.0000048 -0.1128375 0.1001631 -0.0387828 0.0000052 -0.0206028 -0.0857202 -0.0000099 -0.000006 -0.0000112 0.1547502 0.0446915 -0.0257857 -0.0643846 0.0185406 0.070934 0.0683406 -0.0849862 0.017906 -0.0166243 0.0447295 -0.0257871 0.0643692 0.0185631 0.07093 -0.068353 0.0849777 -0.0178954 -0.0166137 0.0909337 0.0623473 -0.0000024 -0.0460717 -0.1348447 0.0000141 -0.0000025 0.0000048 0.11481 0.0708207 0.0269377 0.0000081 -0.0101031 0.0125349 -0.0000161 0.0000048 -0.0000246 0.1876704 -0.0391262 0.0752878 0.0000217 0.0798846 0.0384241 -0.000014 0.0000172 -0.0000092 0.1786861 -0.0390725 -0.0871523 0.0000084 -0.0852597 0.0560763 -0.000003 0.0000105 0.00001 0.1635861 unknown
polarizability: 103.3210145|-5.2901469|85.6248257|-0.0070679|0.0046035|34.6818947 unknown
InChI: InChI=1S/C6H7NO/c1-6-4-2-3-5-7(6)8/h2-5H,1H3
charge 0 multiplicity 1
15 atoms
O  1.674405 -1.439648 -0.000396
N  0.555103 -0.711431 -0.000061
C  0.633866 0.694937 -0.000047
C  -0.556269 1.443701 0.000085
C  2.022831 1.262131 -0.000145
C  -0.69139 -1.336192 -0.00007
C  -1.82642 0.82231 0.00017
C  -1.875265 -0.592455 0.000068
H  -0.468364 2.534713 0.000123
H  2.588777 0.905552 0.880183
H  2.588693 0.905471 -0.880496
H  1.991643 2.363522 -0.000193
H  -0.642909 -2.426068 -0.00019
H  -2.742848 1.418156 0.000274
H  -2.828152 -1.130301 0.000093
