program: Gaussian 09
title: 000151952
version: EM64L-G09RevD.01
frameworkgroup: C1[X(C15H16N2O)]
method: RPBEPBE
basis: SDD
operation: Freq
keyword: #p
keyword: freq=noraman
keyword: PBEPBE/SDD
title: #p freq=noraman PBEPBE/SDD
converged: YES YES NO NO
title: Mulliken charges:
elementType: O N N C C C C C C C C C C C C C C C H H H H H H H H H H H H H H H H
charge: -0.256912 -0.533081 -0.450019 -0.304624 -0.566055 0.473167 0.152166 -0.404143 -0.416256 0.492185 -0.224194 -0.236423 -0.244515 -0.441611 -0.353495 -0.200494 -0.214401 -0.256056 0.242973 0.250497 0.225803 0.287142 0.272451 0.242590 0.241437 0.321808 0.229699 0.228462 0.231381 0.224451 0.306006 0.225624 0.226096 0.228344
chargesum: 0.00000
title: Mulliken charges with hydrogens summed into heavy atoms:
elementType: O N N C C C C C C C C C C C C C C C
charge: -0.256912 0.026512 -0.128211 -0.061651 -0.089756 0.473167 0.152166 -0.161552 -0.174819 0.492185 0.005505 -0.007962 -0.013135 -0.217160 -0.047489 0.025130 0.011694 -0.027712
polarizability: 1.87065738e+02 2.38902430e+01 2.00249022e+02 -2.52869440e+01 1.74870027e+01 1.27109104e+02
1716.lowfreq: -10.3332 -7.3153 -2.5826 -0.0005 0.0001 0.0002 14.5672 22.9899 28.3283
frequency: 14.2793 22.9364 28.1991 53.1383 85.2096 93.4215 123.4420 165.2063 193.4064 238.7589 258.4189 305.8196 324.3774 342.6586 350.3605 376.4221 402.5266 407.9125 494.0236 514.8943 570.2709 599.4500 612.8153 617.2516 663.1778 671.1001 697.3848 701.8849 706.3346 750.8845 768.8033 771.1950 809.3255 819.4946 844.6508 856.9471 875.1822 918.3064 920.4768 949.8784 973.1812 977.5965 984.3852 989.0406 991.1466 998.0112 998.2974 1026.0373 1026.3096 1073.3391 1087.5761 1123.0155 1141.2834 1160.3453 1171.8990 1172.4287 1187.5385 1187.6173 1194.1639 1215.9523 1260.9172 1280.2333 1309.6990 1320.6691 1333.2151 1363.6475 1379.9596 1385.9990 1428.7996 1439.5338 1473.2391 1483.4259 1485.1260 1515.4228 1589.8403 1599.5616 1612.1476 1613.3550 1619.0945 1657.7270 2993.6762 3002.5661 3063.4414 3111.1525 3112.0792 3123.1648 3131.2934 3133.9247 3143.6744 3146.1253 3164.2678 3164.4198 3193.2764 3414.0790 3499.0404 3530.0176
redmass: 4.4091 4.5117 4.3800 4.9035 4.9724 4.2036 4.8807 3.9454 1.2724 4.2858 4.1163 3.2224 4.5215 2.3817 4.1635 5.1201 2.8192 2.9258 3.2599 2.7830 5.6652 5.2634 6.2738 6.3044 1.5739 1.8725 2.0371 4.1389 1.8255 1.6180 1.8538 1.7704 4.6177 4.0439 1.2643 1.2483 4.3724 1.4450 1.5132 1.9822 1.3536 1.4504 5.4367 3.2473 3.2662 1.3695 1.3781 2.1798 2.1826 1.5240 1.5540 1.5897 2.0461 2.0578 1.0555 1.0551 1.1171 1.1177 1.5022 2.7678 2.1212 1.3975 1.4880 1.4591 1.2885 1.3405 7.3573 5.8014 2.3644 2.1483 1.1333 2.2141 2.3666 2.0993 5.9803 6.8953 5.9540 4.7189 5.0199 1.0856 1.0777 1.0668 1.1030 1.0878 1.0884 1.0867 1.0869 1.0910 1.0935 1.0957 1.1012 1.1000 1.0953 1.0457 1.0764 1.0943
irintensity: 2.3012 0.0625 0.1953 1.7805 1.2912 1.8093 0.3724 6.1640 44.7884 11.3991 0.3690 29.3653 2.3823 0.1182 18.4860 9.1997 0.0446 0.0778 28.5807 12.8845 1.0663 3.5852 1.3102 0.2728 28.9160 40.6872 55.3941 5.2457 49.8379 213.9088 129.9552 120.4761 3.9814 7.2184 0.5039 0.3812 18.4553 14.7630 2.6754 3.1518 0.1308 0.8978 0.1319 5.4596 3.8771 4.4410 1.7978 6.9063 4.1628 16.0484 13.3519 16.9703 7.8529 25.1052 0.7613 0.3190 3.1479 1.2556 11.3775 0.2530 39.2251 9.8046 3.0762 36.9193 0.6369 15.1631 0.2812 30.6552 60.8409 7.5085 14.3880 12.3214 65.9321 240.7650 1.5624 76.3363 3.5025 61.5715 84.3508 37.4321 4.8798 37.8530 12.1063 7.8671 13.1966 3.3449 0.9918 8.5980 30.4618 35.2474 11.6261 31.2653 6.2825 1.7084 20.4776 4.0315
temp: 298.150 k
press: 1.00000 atm
elementType: 8 7 7 6 6 6 6 6 6 6 6 6 6 6 6 6 6 6 1 1 1 1 1 1 1 1 1 1 1 1 1 1 1 1
symmnumber: 1
zpe: 727791.3 jmol-1
zpe.correction: 0.277201 hartree
zpe.thermalcorrener: 0.293507 hartree
zpe.thermalcorrenthalpy: 0.294452 hartree
zpe.thermalcorrgfe: 0.230295 hartree
zpe.sumelectzpe: -764.647892 hartree
zpe.sumelectthermal: -764.631585 hartree
zpe.sumelectthermalent: -764.630641 hartree
zpe.sumelectthermalfe: -764.694798 hartree
dipole: 0.2862 -2.6289 -1.7136
dipole: 3.1511
quadrupole: -107.3655 -103.3747 -102.0573
quadrupole: 1.0857 -4.0922 0.1098
quadrupole: -3.0996 0.8911 2.2085 1.0857 -4.0922 0.1098
hfenergy: -764.9250926 hartree
pointgroup: C01 [X(C15H16N2O1)]
dipole: -0.1359354 1.0164386 -0.6966614 debye
polarizability: 184.1115554|24.2052638|201.3827926|26.7494879|-17.3802857|128.9295167 unknown
InChI: InChI=1S/C15H16N2O/c16-14(11-12-7-3-1-4-8-12)15(18)17-13-9-5-2-6-10-13/h1-10,14,17H,11,16H2
charge 0 multiplicity 1
34 atoms
O  0.604197 -2.671725 0.733425
N  -1.77341 -3.572106 -0.50491
N  0.569618 -0.691546 -0.536361
C  -1.45631 -2.135032 -0.505996
C  -2.468184 -1.380709 0.421759
C  -2.40284 0.133915 0.302146
C  0.008547 -1.862585 -0.043094
C  -1.827133 0.933303 1.322691
C  -2.89935 0.780229 -0.862539
C  1.859444 -0.137357 -0.287009
C  -1.744427 2.337985 1.185384
C  -2.817295 2.183932 -1.005557
C  -2.236929 2.968618 0.019318
C  2.134791 1.144414 -0.836376
C  2.858882 -0.811943 0.464532
C  3.395351 1.743929 -0.643906
C  4.116456 -0.196428 0.647828
C  4.397014 1.075899 0.099207
H  -1.594599 -1.754984 -1.537545
H  -3.464798 -1.757995 0.128442
H  -2.288326 -1.700459 1.465909
H  -1.502432 -4.001142 0.39164
H  -1.3122 -4.075077 -1.273789
H  -1.435982 0.45035 2.226314
H  -3.370119 0.17995 -1.65217
H  -0.058739 -0.098973 -1.087724
H  -1.295158 2.937461 1.984929
H  -3.213896 2.665442 -1.906754
H  -2.175753 4.057405 -0.086957
H  1.35874 1.671895 -1.406466
H  2.636826 -1.791129 0.892131
H  3.594069 2.732585 -1.072295
H  4.883821 -0.721483 1.227915
H  5.377226 1.540965 0.24878
