program: Gaussian 09
title: 000151920
version: EM64L-G09RevD.01
frameworkgroup: C1[X(C6H5N2O8P)]
method: RPBEPBE
basis: SDD
operation: Freq
keyword: #p
keyword: freq=noraman
keyword: PBEPBE/SDD
title: #p freq=noraman PBEPBE/SDD
converged: YES YES NO NO
title: Mulliken charges:
elementType: P O O O O O O O O N N C C C C C C H H H H H
charge: 1.342755 -0.528111 -0.643023 -0.633573 -0.566172 -0.182371 -0.181175 -0.181295 -0.185335 0.022323 0.023531 0.461222 0.461159 0.463184 -0.516000 -0.484425 -0.512663 0.324834 0.350525 0.340361 0.413670 0.410579
chargesum: 0.00000
title: Mulliken charges with hydrogens summed into heavy atoms:
elementType: P O O O O O O O O N N C C C C C C
charge: 1.342755 -0.528111 -0.229353 -0.222994 -0.566172 -0.182371 -0.181175 -0.181295 -0.185335 0.022323 0.023531 0.461222 0.461159 0.463184 -0.191165 -0.133900 -0.172302
polarizability: 1.83995872e+02 2.12169696e+00 1.62012667e+02 -7.63168595e+00 7.87684995e-01 6.78349092e+01
1716.lowfreq: -0.0014 -0.0014 -0.0012 1.5364 3.9548 6.9458 15.2606 30.8053 50.7010
frequency: 15.1433 30.7955 50.7007 52.8835 76.2369 122.6409 137.5534 146.6385 171.2863 192.1975 204.4156 235.5904 249.8024 300.5253 316.0992 333.8378 339.8882 354.6274 375.3646 415.6170 471.7778 483.2745 517.2840 545.9872 596.3945 652.2258 665.4295 684.2736 704.9755 716.4126 724.7091 748.9642 763.4875 868.6071 941.9123 954.6652 957.2636 962.4711 984.7667 1015.6975 1031.2871 1061.8698 1069.8494 1096.3703 1206.0651 1206.2616 1229.8848 1235.6267 1383.9323 1384.5995 1395.3947 1446.0172 1458.8587 1591.7676 1615.8533 3156.1066 3196.1279 3199.1893 3590.7021 3597.2392
redmass: 9.0548 7.4993 15.6896 14.8052 10.3777 5.9251 3.8977 2.8403 5.9381 4.9641 3.8965 3.6619 1.8298 3.7432 3.5366 9.8351 10.9960 6.9052 11.2243 9.0369 5.9694 10.7399 8.0191 6.7806 5.3137 9.8171 3.6894 12.3866 3.5187 10.1662 8.5195 10.7944 8.1628 11.5856 1.4993 3.3053 1.7318 1.6109 6.2405 1.2629 1.3430 4.4586 1.4751 1.5986 14.5681 9.1877 9.8335 1.2497 9.9543 11.5058 6.0559 4.9255 3.8574 8.1674 8.2348 1.0939 1.0930 1.0932 1.0665 1.0667
irintensity: 0.1044 0.5866 0.0176 0.0281 0.5949 22.1798 39.8862 34.5813 4.6874 1.1004 27.9732 26.8747 79.3778 39.6435 33.4230 24.0074 26.2262 30.3353 49.1847 45.9955 0.0068 1.5417 19.3790 1.1832 2.4181 5.4815 6.2821 48.9334 22.6927 133.6068 0.4371 126.2037 390.9771 21.6477 21.1999 141.3204 43.0317 65.1074 3.5491 38.5397 76.1478 180.2359 17.6658 2.6759 317.9401 8.0352 336.2329 2.0396 64.1545 67.8914 21.3499 17.5270 277.8223 12.1537 50.2692 20.4931 15.8395 24.3812 125.6551 98.5490
temp: 298.150 k
press: 1.00000 atm
elementType: 15 8 8 8 8 8 8 8 8 7 7 6 6 6 6 6 6 1 1 1 1 1
symmnumber: 1
zpe: 330381.2 jmol-1
zpe.correction: 0.125836 hartree
zpe.thermalcorrener: 0.142650 hartree
zpe.thermalcorrenthalpy: 0.143594 hartree
zpe.thermalcorrgfe: 0.078566 hartree
zpe.sumelectzpe: -1282.720464 hartree
zpe.sumelectthermal: -1282.703649 hartree
zpe.sumelectthermalent: -1282.702705 hartree
zpe.sumelectthermalfe: -1282.767734 hartree
dipole: 5.6314 -1.3672 -0.3037
dipole: 5.8029
quadrupole: -105.1660 -132.8513 -93.8470
quadrupole: -5.4026 1.3357 3.8678
quadrupole: 5.4554 -22.2299 16.7744 -5.4026 1.3357 3.8678
hfenergy: -1282.8462993 hartree
pointgroup: C01 [X(C6H5N2O8P1)]
dipole: 2.1538948 -0.7559922 0.0386994 debye
dipolederiv: 3.0288199 -0.3994221 -0.0433848 0.0553948 1.5145417 0.1655092 0.3936135 0.0352324 1.9524159 -2.3776002 0.3980837 -0.0893048 0.2366408 -0.4589528 0.0133031 0.004725 -0.0202652 -0.3995257 -0.6186462 0.1801569 -0.0604318 0.1149744 -0.5176374 0.0457736 -0.3325476 0.056993 -1.0762642 -1.0124078 0.2188867 0.1340636 0.2963221 -0.7708865 -0.2768553 0.1695136 -0.2349418 -0.510586 -0.8697675 0.0221685 0.0061729 0.0027431 -0.5980037 0.0069384 -0.0374256 0.0279216 -0.6249811 -0.6497573 0.1334604 0.0142669 0.2102819 -0.6333393 0.0401071 0.0126824 0.0379004 -0.2133497 -0.8124602 0.0379356 0.0340944 -0.0311141 -0.4929503 0.0277159 0.0509154 0.0281994 -0.2123145 -0.585314 -0.083904 0.0381839 -0.1592876 -0.6812184 0.0733394 0.0483562 0.0591682 -0.2140552 -0.5176605 -0.1027482 0.0292966 -0.0354917 -0.7958374 0.0556938 0.0280557 0.0680468 -0.2170826 1.0181199 -0.0875915 -0.053882 -0.098743 1.5860643 -0.1669298 -0.0605194 -0.1508622 0.1993934 1.4228284 0.3029859 -0.1148707 0.3229536 1.2629754 -0.1197988 -0.131175 -0.1402518 0.2020865 1.6413917 -0.4992188 0.0498469 -0.9760481 0.0040368 -0.0335789 -0.0789307 0.0463438 0.0939692 0.0336122 0.0480515 -0.0074907 0.0031832 -0.3595052 0.0491338 0.0175768 0.0419742 0.0824337 -0.2149642 -0.2251866 0.0444846 -0.2301818 -0.1377351 0.030969 0.0557308 0.037277 0.0782039 -0.2616078 0.2563505 -0.0554273 -0.0845997 -0.0188188 0.0035826 -0.0151183 -0.0123047 -0.0903555 -0.2469966 -0.1533734 0.018603 0.3468134 -0.0463639 -0.0031065 -0.031647 0.0070129 -0.0997662 -0.2056628 0.0898031 -0.0111768 0.1339315 0.0197572 -0.0106724 -0.0059354 -0.0153247 -0.0863863 0.1770021 0.0020259 0.0052962 0.0458249 0.1245594 0.0079828 -0.0067244 0.0101647 0.1772599 0.1898849 -0.0272485 0.017943 -0.0516233 0.1773533 -0.0040854 0.0102715 -0.0014019 0.1794391 0.1577772 0.0162921 0.0018935 0.0108887 0.1829083 -0.0012911 -0.0022574 -0.0029919 0.1899823 0.2523341 -0.1041619 0.0276661 -0.1132721 0.3126285 0.0283653 -0.0221225 -0.0101493 0.3867262 0.451075 -0.0233458 0.0141575 0.0004089 0.3264239 0.0679043 -0.0670375 0.1322592 0.202757 unknown
polarizability: 184.4837952|-0.799915|160.3195816|-4.7536061|-11.8584531|69.0400716 unknown
InChI: InChI=1S/C6H5N2O8P/c9-7(10)4-1-5(8(11)12)3-6(2-4)16-17(13,14)15/h1-3,13-14H
charge 0 multiplicity 1
22 atoms
P  3.432804 -0.494048 0.232775
O  1.914531 -1.212493 -0.205833
O  3.335498 -0.700383 1.918338
O  4.481108 -1.75912 -0.212656
O  3.738993 0.953219 -0.337438
O  -2.160687 3.315239 -0.335392
O  -4.069055 -1.13918 0.294239
O  0.098862 3.56424 -0.540074
O  -2.694658 -2.959635 0.37313
N  -0.960479 2.849918 -0.378684
N  -2.907624 -1.694023 0.260486
C  0.670921 -0.547886 -0.13046
C  -0.784527 1.373991 -0.229596
C  -1.721987 -0.806544 0.076356
C  -0.443251 -1.392892 0.047661
C  0.523304 0.848693 -0.280506
C  -1.930834 0.578982 -0.05494
H  -0.317339 -2.472068 0.16128
H  1.376998 1.517082 -0.437612
H  -2.932055 1.014031 -0.024561
H  4.048051 -0.262891 2.450387
H  4.804525 -1.735133 -1.1497
