program: Gaussian 09
title: 000151902
version: EM64L-G09RevD.01
frameworkgroup: C1[X(C10H8N2O)]
method: RPBEPBE
basis: SDD
operation: Freq
keyword: #p
keyword: freq=noraman
keyword: PBEPBE/SDD
title: #p freq=noraman PBEPBE/SDD
converged: YES YES NO NO
title: Mulliken charges:
elementType: O N N C C C C C C C C C C H H H H H H H H
charge: -0.269696 -0.288080 0.035179 0.426985 -0.331505 -0.360644 0.209804 -0.227057 -0.210317 -0.241393 -0.292517 -0.147461 -0.339069 0.306916 0.277619 0.229318 0.228489 0.267007 0.230740 0.243394 0.252290
chargesum: 0.00000
title: Mulliken charges with hydrogens summed into heavy atoms:
elementType: O N N C C C C C C C C C C
charge: -0.269696 -0.288080 0.035179 0.426985 -0.024589 -0.083025 0.209804 0.002261 0.018172 -0.010653 -0.025510 0.095933 -0.086779
polarizability: 2.03631196e+02 4.98983263e+00 1.31670641e+02 -1.18741957e-01 2.24612043e+00 5.01548299e+01
1716.lowfreq: -11.6371 -7.1347 -0.0008 -0.0005 -0.0004 5.6077 20.6919 69.2232 140.5796
frequency: 20.6412 69.2203 140.5786 194.6264 268.9450 315.9250 345.9070 402.6478 408.2480 513.0169 526.4483 549.3736 562.3423 587.8867 616.8876 683.4023 690.6395 717.2300 773.9268 813.1757 829.1612 847.8614 889.4148 931.0205 980.6882 981.7728 986.7036 988.8190 997.7646 1014.7103 1032.1233 1070.8555 1096.4839 1108.4112 1173.3663 1187.3311 1203.2772 1247.0131 1321.4754 1341.0147 1377.1992 1388.4536 1442.2415 1474.1494 1511.3710 1556.8694 1591.3536 1604.2165 1634.6127 3131.1767 3144.2760 3151.0557 3162.9552 3170.2484 3186.0840 3192.6713 3214.3701
redmass: 4.5791 4.9823 4.9187 5.1320 4.9772 7.3819 6.3024 3.2452 3.8719 4.5201 4.3922 3.9075 6.4083 7.7822 6.4748 5.8990 2.0800 3.5388 1.7613 1.5046 6.0966 1.2984 1.3671 1.4248 1.4146 1.3447 5.0545 5.2149 1.3913 3.6258 2.1128 2.2638 1.6927 1.9790 1.0519 1.3004 1.5060 3.5777 1.3315 1.4482 2.7118 4.4318 2.3682 2.1829 6.7716 6.8444 6.6959 6.1558 7.4470 1.0856 1.0913 1.0879 1.0984 1.0929 1.1003 1.0942 1.0944
irintensity: 0.8413 6.5422 1.5588 1.9043 0.6035 4.0581 1.8782 0.4249 1.4048 2.8264 3.2818 2.9153 4.8352 17.1338 1.4480 5.8614 40.7577 16.6480 68.1525 71.1095 8.0187 2.0009 0.0650 8.4904 0.2685 0.3207 5.3050 28.1622 1.4402 6.9100 6.1040 23.9609 9.1083 49.8015 0.3402 3.0225 17.5548 16.5531 3.9257 2.5594 5.3515 0.4725 20.4839 52.7594 45.5085 90.6017 6.4483 6.3748 120.1925 0.1489 21.7227 4.8630 33.0341 8.0326 7.4462 3.2564 8.0116
temp: 298.150 k
press: 1.00000 atm
elementType: 8 7 7 6 6 6 6 6 6 6 6 6 6 1 1 1 1 1 1 1 1
symmnumber: 1
zpe: 414886.7 jmol-1
zpe.correction: 0.158022 hartree
zpe.thermalcorrener: 0.167935 hartree
zpe.thermalcorrenthalpy: 0.168879 hartree
zpe.thermalcorrgfe: 0.121211 hartree
zpe.sumelectzpe: -569.662863 hartree
zpe.sumelectthermal: -569.652950 hartree
zpe.sumelectthermalent: -569.652006 hartree
zpe.sumelectthermalfe: -569.699674 hartree
dipole: -1.6170 -2.4733 0.2897
dipole: 2.9691
quadrupole: -53.2581 -76.4553 -79.1171
quadrupole: 4.2782 -0.4106 2.8342
quadrupole: 16.3521 -6.8452 -9.5069 4.2782 -0.4106 2.8342
hfenergy: -569.8208851 hartree
pointgroup: C01 [X(C10H8N2O1)]
dipole: 0.6258837 -0.9847921 -0.0548227 debye
dipolederiv: -0.3893653 0.2761814 0.0304313 0.0152589 -1.1357389 -0.0628917 -0.0137495 -0.0550863 -0.3587324 -0.205052 -0.3627391 -0.0327673 0.6814121 -0.5801373 0.0037393 0.0104641 -0.0247906 -0.0357771 0.180105 -0.0139517 -0.0000393 -0.7641999 -0.0686785 -0.0039453 0.0689541 -0.0138382 -0.1245708 0.6050388 0.0538039 -0.0039301 -0.0758858 0.0215147 -0.0379813 -0.0498867 -0.0171208 0.053787 -0.1197502 0.0682168 -0.0161682 -0.0458994 -0.0590037 -0.0227663 0.0156464 0.0040659 -0.1306791 -0.0642727 -0.083791 0.0072105 0.0157944 -0.0459429 -0.025268 -0.0085809 -0.0102597 -0.1401062 0.1160348 -0.2633523 -0.0165134 -0.098275 1.3649728 0.090198 -0.0073603 0.0714799 0.2369051 -0.0162526 -0.119087 0.0258851 -0.1404942 0.0871928 -0.069274 0.0569524 -0.0513743 -0.1425428 -0.1040894 0.1046442 -0.0246575 0.1881246 0.0879449 -0.0743304 -0.0498141 -0.0665698 -0.140218 0.0579146 -0.0092734 -0.0047948 -0.0601595 -0.0477013 -0.0202388 0.0222397 -0.0303491 -0.1474306 0.1275504 0.3764034 0.0319491 -0.0896917 -0.1028861 0.00067 0.0061612 0.0114258 -0.1487906 0.2220465 0.0085468 0.003905 0.4242616 0.0922456 0.0125163 0.0335707 0.0112323 -0.063855 -0.5877856 -0.0920808 -0.0045572 -0.1239479 0.2058868 0.0167432 -0.0468549 0.0235078 -0.0961732 0.1730003 -0.0597901 0.0189702 -0.0176111 0.072697 0.0387114 0.0243486 0.0128909 0.1677585 0.1267033 0.06585 -0.0225863 0.0568669 0.031793 0.0430784 -0.0410555 0.0302468 0.158614 0.013004 0.0738534 -0.0212904 0.104534 -0.0501966 0.0576891 -0.0307648 0.0529953 0.1411768 0.0111324 -0.0785602 0.0241901 -0.1058883 -0.0541708 0.0606181 0.0264403 0.0588293 0.13906 0.0532357 -0.0320588 -0.0032601 -0.0718076 0.0209472 -0.0102068 -0.0177619 -0.0063477 0.1626887 -0.1422273 0.0022598 0.0038829 -0.0014585 0.1007063 0.0180599 -0.0004511 0.0152546 0.1593142 -0.1024193 0.0422371 0.0005348 0.0499262 0.1013469 -0.0028915 0.0064119 -0.0029303 0.1562002 0.0454487 0.0426876 0.0036057 0.0591404 -0.0427918 -0.0122295 -0.0049096 -0.0132618 0.153371 unknown
polarizability: 203.5197306|-5.7603248|131.1727317|-0.4876073|-7.3428466|50.7642042 unknown
InChI: InChI=1S/C10H8N2O/c13-10-7-4-8-11-12(10)9-5-2-1-3-6-9/h1-8H
charge 0 multiplicity 1
21 atoms
O  1.040015 2.242022 0.089151
N  0.667843 -0.120139 -0.057195
N  1.164952 -1.411724 -0.126311
C  -0.788572 -0.062541 -0.033928
C  -1.496912 1.125514 -0.353747
C  -1.503406 -1.243556 0.300752
C  1.51254 1.067251 0.024917
C  -2.909544 1.115604 -0.33535
C  -2.911366 -1.232817 0.317605
C  -3.625965 -0.053726 -0.000686
C  2.944786 0.777261 0.029063
C  3.433114 -0.512008 -0.046712
C  2.487912 -1.589495 -0.123029
H  -0.955152 2.040005 -0.591292
H  -0.948042 -2.154042 0.532495
H  -3.446872 2.037239 -0.584174
H  -3.450649 -2.148925 0.58249
H  3.595363 1.653659 0.095983
H  -4.721222 -0.048226 0.015458
H  4.506866 -0.723026 -0.049064
H  2.804411 -2.634231 -0.186828
