program: Gaussian 09
title: 000151866
version: EM64L-G09RevD.01
frameworkgroup: C1[X(C20H14N2O2)]
method: RPBEPBE
basis: SDD
operation: Freq
keyword: #p
keyword: freq=noraman
keyword: PBEPBE/SDD
title: #p freq=noraman PBEPBE/SDD
converged: YES YES NO NO
title: Mulliken charges:
elementType: O O N N C C C C C C C C C C C C C C C C C C C C H H H H H H H H H H H H H H
charge: -0.252519 -0.224707 -0.030307 -0.055050 0.096820 0.234854 0.235203 -0.103257 -0.089955 -0.344449 -0.373407 -0.305936 -0.307219 0.017724 -0.261717 -0.251346 -0.236360 -0.229848 0.274731 -0.196345 -0.474860 -0.326266 0.181416 -0.493518 0.248935 0.251064 0.268878 0.267726 0.234213 0.232467 0.236280 0.234989 0.278267 0.283819 0.265309 0.230135 0.249654 0.234582
chargesum: 0.00000
title: Mulliken charges with hydrogens summed into heavy atoms:
elementType: O O N N C C C C C C C C C C C C C C C C C C C C
charge: -0.252519 -0.224707 -0.030307 -0.055050 0.096820 0.234854 0.235203 -0.103257 -0.089955 -0.095514 -0.122343 -0.037058 -0.039493 0.017724 -0.027504 -0.018879 -0.000080 0.005141 0.274731 0.081922 -0.191041 -0.060957 0.181416 0.220852
polarizability: 4.24396938e+02 -2.17779435e+01 3.05379100e+02 1.54655761e+01 4.04434027e+00 1.58664840e+02
1716.lowfreq: -7.6502 -2.6519 -0.0002 0.0003 0.0005 4.9945 21.2182 36.2817 44.3916
frequency: 21.1910 36.2472 44.3758 49.3856 79.3541 90.0690 113.4419 142.5604 160.3993 166.7884 203.3226 238.5843 246.4931 265.5876 294.7508 303.3927 325.6571 370.4201 393.7222 402.1605 425.2116 440.2147 464.1733 469.7436 473.8075 502.8972 527.0841 569.7256 577.7306 602.1430 605.2878 628.7423 636.9016 651.2804 673.8086 685.9903 742.5305 746.2481 768.2941 772.8367 778.3028 800.4359 817.5618 847.6939 855.8662 864.4643 870.3463 880.9340 882.3321 925.0461 963.6791 965.6380 971.4106 985.9802 995.8879 997.6220 1015.5254 1020.4598 1063.4777 1089.0650 1101.3448 1108.2440 1137.8389 1149.4948 1159.5502 1177.0287 1198.0159 1210.9812 1221.8432 1247.2142 1283.0696 1286.6957 1293.4405 1302.4348 1360.8652 1361.7226 1372.0673 1390.3109 1420.7059 1438.0969 1441.5783 1450.5256 1452.3423 1452.9881 1473.2624 1507.5908 1513.8192 1528.1219 1540.0376 1565.1846 1570.3610 1606.4040 1628.2986 1630.5719 3002.4992 3113.5921 3130.9491 3132.1509 3133.1628 3143.2285 3143.9035 3145.0371 3159.2263 3160.3169 3168.8214 3172.2643 3173.4951 3179.9582
redmass: 5.2111 4.8032 5.0408 4.2800 5.1337 5.3471 3.8763 4.5709 5.8411 3.3733 1.2851 4.7278 4.3863 5.1487 4.8173 5.7754 6.1616 5.8485 6.7680 3.8977 5.0426 5.8079 3.4529 5.9166 3.5714 3.3174 8.1900 5.2851 4.2092 5.1875 4.1744 4.9812 6.4628 6.0679 6.5617 4.7989 3.4563 3.5742 1.9051 2.0059 1.7851 2.9921 1.7061 5.2367 6.3310 5.9276 1.5761 1.6882 1.7187 6.8913 3.7361 1.3577 1.3575 1.2925 1.3295 1.3282 2.1805 2.1095 4.3397 2.2977 1.2412 1.9816 1.3163 1.3701 1.1646 1.1515 2.2310 1.5673 1.4580 2.9214 1.6668 4.9975 3.2119 3.9618 2.7512 2.3370 2.2513 2.9785 7.8824 2.8754 1.2400 2.1395 1.1885 1.0581 2.8453 9.1504 7.7267 6.2197 7.5681 9.2964 7.8627 5.8376 6.6038 6.8743 1.0289 1.1037 1.1052 1.0862 1.0851 1.0895 1.0876 1.0882 1.0958 1.0956 1.0998 1.0997 1.1000 1.0925
irintensity: 2.4784 4.8566 0.2014 3.4578 3.7824 1.5899 1.7292 1.6303 1.1725 3.1832 1.7418 3.3336 5.0620 2.9955 0.2188 1.5813 7.6296 17.4900 1.4275 1.9762 2.9432 14.7675 6.5554 24.5606 0.3632 0.6014 8.5152 0.9247 2.8808 6.0057 8.0066 8.9062 10.8722 7.7926 4.3856 40.2299 7.1661 2.8159 78.5266 1.0518 54.7347 7.1520 9.9675 7.4411 16.4925 0.8481 5.8023 44.1999 9.3158 4.1282 4.6412 0.3345 1.8397 1.0599 0.6682 0.6041 5.0088 9.0147 15.3746 119.7693 2.1271 0.2359 6.8560 4.9283 0.7186 1.1840 120.1782 34.6109 0.8945 3.3182 0.0832 1.5496 6.2848 46.1610 46.1844 10.8672 6.7609 5.5801 49.4811 26.5212 4.6889 7.6248 34.4479 16.4761 3.7273 67.1391 54.7083 6.2178 47.7297 16.4729 194.2571 3.5341 24.8214 47.6644 34.0057 28.8578 36.9862 0.5339 0.6933 8.9431 2.7944 5.7606 16.7126 15.0976 4.5580 37.7626 20.8084 0.2231
temp: 298.150 k
press: 1.00000 atm
elementType: 8 8 7 7 6 6 6 6 6 6 6 6 6 6 6 6 6 6 6 6 6 6 6 6 1 1 1 1 1 1 1 1 1 1 1 1 1 1
symmnumber: 1
zpe: 747934.8 jmol-1
zpe.correction: 0.284873 hartree
zpe.thermalcorrener: 0.304279 hartree
zpe.thermalcorrenthalpy: 0.305223 hartree
zpe.thermalcorrgfe: 0.235710 hartree
zpe.sumelectzpe: -1028.807433 hartree
zpe.sumelectthermal: -1028.788028 hartree
zpe.sumelectthermalent: -1028.787084 hartree
zpe.sumelectthermalfe: -1028.856597 hartree
dipole: 2.8977 -0.5035 2.2305
dipole: 3.6913
quadrupole: -170.1030 -119.7669 -136.6588
quadrupole: -2.4763 -13.2699 1.0648
quadrupole: -27.9268 22.4093 5.5175 -2.4763 -13.2699 1.0648
hfenergy: -1029.0923063 hartree
pointgroup: C01 [X(C20H14N2O2)]
dipole: -1.0407332 -0.0293438 1.0124564 debye
polarizability: 411.9908637|-23.5722384|290.446524|-44.0191475|56.2303353|186.0034899 unknown
InChI: InChI=1S/C20H14N2O2/c1-24-19-12-13(23)10-11-18(19)22-20-14-6-2-4-8-16(14)21-17-9-5-3-7-15(17)20/h2-12H,1H3
charge 0 multiplicity 1
38 atoms
O  3.49314 0.184784 1.845589
O  5.303024 -0.4653 -2.497384
N  -3.376835 -0.166633 -0.178738
N  0.820075 0.140809 0.665023
C  -0.527097 0.019536 0.311162
C  -1.115725 -1.230791 -0.095956
C  -1.382214 1.156718 0.508886
C  -2.560239 -1.258138 -0.320802
C  -2.803596 1.01122 0.23083
C  -0.373666 -2.453804 -0.240483
C  -0.880281 2.432138 0.933932
C  -3.175694 -2.497006 -0.721986
C  -3.659511 2.15722 0.386597
C  1.87508 -0.074955 -0.102878
C  -1.007318 -3.633921 -0.622964
C  -1.74062 3.518693 1.084825
C  -2.421471 -3.655292 -0.874195
C  -3.142472 3.381011 0.803135
C  3.241536 -0.02093 0.499739
C  1.787151 -0.285381 -1.563878
C  4.358499 -0.150451 -0.306458
C  2.901368 -0.395757 -2.346138
C  4.26757 -0.341451 -1.753581
C  2.495331 0.02434 2.925417
H  0.703108 -2.463619 -0.044205
H  0.190043 2.534707 1.141242
H  -4.257045 -2.479181 -0.887831
H  -4.721584 2.019503 0.16251
H  -0.425433 -4.555748 -0.728796
H  -1.349727 4.485487 1.420031
H  -2.902373 -4.591859 -1.176273
H  -3.803519 4.24667 0.919988
H  0.782693 -0.30961 -1.998979
H  5.355014 -0.115649 0.142728
H  2.842752 -0.518745 -3.433106
H  1.950684 -0.930074 2.829662
H  1.773403 0.854449 2.924345
H  3.105851 0.031515 3.841693
