program: Gaussian 09
title: 000151853
version: EM64L-G09RevD.01
frameworkgroup: C1[X(C17H14N2O4)]
method: RPBEPBE
basis: SDD
operation: Freq
keyword: #p
keyword: freq=noraman
keyword: PBEPBE/SDD
title: #p freq=noraman PBEPBE/SDD
converged: YES YES NO NO
title: Mulliken charges:
elementType: O O O O N N C C C C C C C C C C C C C C C C C H H H H H H H H H H H H H H
charge: -0.270753 -0.285248 -0.201732 -0.184205 -0.076283 -0.006524 0.310774 -0.188979 0.101048 0.255217 0.184540 -0.295007 0.219110 -0.290199 -0.368604 -0.369670 0.214824 -0.354278 -0.357037 -0.232119 -0.217094 -0.531291 -0.522067 0.280501 0.248652 0.243926 0.253003 0.278970 0.275845 0.239838 0.243155 0.246228 0.224422 0.223289 0.272609 0.224324 0.210815
chargesum: 0.00000
title: Mulliken charges with hydrogens summed into heavy atoms:
elementType: O O O O N N C C C C C C C C C C C C C C C C C
charge: -0.270753 -0.285248 -0.201732 -0.184205 -0.076283 -0.006524 0.310774 -0.188979 0.101048 0.255217 0.184540 -0.014505 0.219110 -0.041548 -0.124678 -0.116666 0.214824 -0.075308 -0.081193 0.007719 0.026061 0.162648 0.185682
polarizability: 3.68881301e+02 -1.79384174e+00 2.38136523e+02 1.43849560e+01 -5.22762530e+00 1.20611756e+02
1716.lowfreq: -5.6223 -3.6976 -0.0008 -0.0005 0.0004 4.4245 26.3549 39.3026 49.9894
frequency: 26.2962 39.2822 49.9785 59.9392 78.9125 84.5571 105.8460 124.8196 140.6922 155.6838 164.5655 177.3107 188.6959 230.1351 243.5973 257.9776 279.5642 312.9490 339.0339 372.4323 387.5108 413.3173 427.9307 429.6495 449.3057 485.3334 514.4267 543.1390 560.4562 577.5461 609.2135 630.8848 642.3409 667.7566 678.1910 693.4265 701.2184 705.8490 752.0667 782.6705 786.6616 811.9379 824.6353 857.2573 860.0827 892.9609 915.8103 928.5115 948.7672 972.0137 997.8567 998.8351 1023.9062 1039.8704 1049.2604 1066.2287 1093.7634 1107.8746 1114.4621 1134.4718 1144.6409 1153.8429 1165.1352 1174.9302 1185.1329 1217.2059 1228.8893 1249.9552 1254.6399 1287.0797 1304.3136 1332.4354 1364.1383 1382.4380 1387.1570 1405.9781 1414.4281 1426.8955 1434.3324 1447.1802 1455.6359 1467.4861 1470.2980 1474.0022 1487.0718 1506.5512 1559.4819 1573.8510 1588.1731 1602.9768 1610.0823 2962.5442 2973.5330 3051.4762 3084.8916 3127.7744 3128.1696 3142.9408 3155.4316 3156.7892 3158.9442 3170.6912 3174.8566 3181.4923 3183.2712
redmass: 6.6672 5.2826 8.7713 2.3389 4.7054 2.4730 3.1209 4.7765 2.4925 4.4788 3.1908 4.7444 4.8451 2.6000 1.5297 6.7716 3.4094 5.4794 7.3805 5.5776 6.0785 4.2240 4.5584 4.7148 4.8103 6.9904 4.6342 5.4156 4.1197 6.2581 4.7168 3.9202 6.7800 6.1921 6.5415 7.0152 6.0425 4.3047 3.7164 1.5496 6.3221 5.2371 1.4921 2.1362 3.0005 1.4255 5.8583 1.4472 7.2687 1.3857 1.3342 1.3492 4.4520 3.7055 4.8657 3.0259 2.0931 1.2439 1.2595 1.8611 1.3747 1.4267 1.3864 1.0686 1.6572 11.2238 1.9036 2.7593 1.7586 3.3789 2.6389 7.6789 11.1136 5.7479 2.7443 3.8629 1.7592 1.9824 1.4749 1.4860 1.3201 1.0499 2.4544 1.1391 1.0568 3.6578 7.0419 6.7272 6.5473 7.0931 7.4390 1.0328 1.0342 1.1041 1.0974 1.1053 1.0997 1.0867 1.0878 1.0891 1.0909 1.0958 1.0954 1.0976 1.0986
irintensity: 2.5623 2.0860 1.1248 5.0274 1.4047 0.2924 1.3959 1.0455 4.7155 8.4742 1.5397 4.6621 1.8821 2.5176 1.7477 4.1754 5.3140 0.2878 0.5116 0.4943 2.3238 2.5941 5.6374 2.2834 2.3990 0.9814 1.9811 5.4491 2.1305 0.3119 17.6041 2.4889 3.0775 12.2058 32.8247 4.1914 6.5205 1.3078 20.3228 63.6480 13.9848 12.4140 42.7410 29.7825 7.1953 1.6941 7.2140 0.8703 17.0736 2.6714 1.7287 2.4687 0.2905 13.0432 151.4199 67.2228 11.6703 16.2662 0.0801 3.3512 1.2380 9.4753 15.6128 3.7289 14.6954 208.4209 207.0377 23.2226 7.0127 42.9544 9.4318 0.9719 168.2234 7.1488 131.2696 27.5490 8.3240 15.1445 51.6885 79.2723 58.8029 14.1621 15.3307 35.4151 15.4838 8.3629 6.1487 10.9343 102.4090 3.5895 10.0574 87.3952 92.7778 44.5152 28.4476 12.1749 19.5385 2.9223 10.4311 2.8666 8.6362 7.5005 13.0846 4.1489 9.9495
temp: 298.150 k
press: 1.00000 atm
elementType: 8 8 8 8 7 7 6 6 6 6 6 6 6 6 6 6 6 6 6 6 6 6 6 1 1 1 1 1 1 1 1 1 1 1 1 1 1
symmnumber: 1
zpe: 723255.2 jmol-1
zpe.correction: 0.275473 hartree
zpe.thermalcorrener: 0.295614 hartree
zpe.thermalcorrenthalpy: 0.296558 hartree
zpe.thermalcorrgfe: 0.225616 hartree
zpe.sumelectzpe: -1064.876924 hartree
zpe.sumelectthermal: -1064.856783 hartree
zpe.sumelectthermalent: -1064.855839 hartree
zpe.sumelectthermalfe: -1064.926782 hartree
dipole: 1.8678 1.5154 -1.9607
dipole: 3.1031
quadrupole: -96.1519 -134.2488 -135.8769
quadrupole: -23.1524 7.5984 7.2588
quadrupole: 25.9407 -12.1563 -13.7844 -23.1524 7.5984 7.2588
hfenergy: -1065.1523975 hartree
pointgroup: C01 [X(C17H14N2O4)]
dipole: 0.7333131 -0.2770353 0.9359494 debye
polarizability: 369.0563557|-1.7325333|219.8792952|-12.5925251|-42.9878386|138.6939292 unknown
InChI: InChI=1S/C17H14N2O4/c1-22-15-9-10-16(23-2)17-12(15)7-8-13(18-17)11-5-3-4-6-14(11)19(20)21/h3-10H,1-2H3
charge 0 multiplicity 1
37 atoms
O  3.780354 2.307465 -0.457707
O  1.915003 -2.936675 0.605209
O  -3.983943 2.319727 -1.924396
O  -2.151475 1.064111 -2.445991
N  0.040195 -0.731225 0.221516
N  -3.135334 1.376214 -1.671543
C  1.946323 0.796096 -0.152783
C  1.402429 -0.522929 0.107475
C  -0.808904 0.307673 0.055886
C  -2.256815 0.000636 0.277273
C  3.369652 0.988759 -0.208655
C  1.021443 1.875214 -0.309239
C  2.314828 -1.633292 0.280592
C  -0.347278 1.640347 -0.209631
C  4.230288 -0.098103 -0.008835
C  3.693115 -1.396005 0.227114
C  -3.345006 0.57428 -0.437821
C  -2.590366 -0.875283 1.344631
C  -4.692903 0.343978 -0.080948
C  -3.929634 -1.141527 1.695449
C  -4.987944 -0.517031 0.992959
C  5.22108 2.562744 -0.524629
C  0.877296 -3.585344 -0.229057
H  1.412294 2.878774 -0.495442
H  -1.058545 2.464795 -0.307648
H  5.31644 0.024188 -0.039628
H  4.362126 -2.248881 0.376431
H  -1.762751 -1.332786 1.895036
H  -5.482907 0.825423 -0.663693
H  -4.147685 -1.823565 2.523956
H  -6.029638 -0.708663 1.268747
H  5.314142 3.639538 -0.727259
H  5.691325 1.985321 -1.343933
H  5.715772 2.3178 0.435281
H  -0.060603 -3.009991 -0.19558
H  0.748637 -4.585488 0.212779
H  1.234389 -3.679495 -1.273016
