program: Gaussian 09
title: 000151835
version: EM64L-G09RevD.01
frameworkgroup: C1[X(C4H11NO3S)]
method: RPBEPBE
basis: SDD
operation: Freq
keyword: #p
keyword: freq=noraman
keyword: PBEPBE/SDD
title: #p freq=noraman PBEPBE/SDD
converged: YES YES NO NO
title: Mulliken charges:
elementType: S O O O N C C C C H H H H H H H H H H H
charge: 1.144680 -0.404053 -0.507508 -0.508458 -0.556119 -0.050162 -0.652319 -0.654551 -0.484677 0.262310 0.328952 0.219804 0.204578 0.249414 0.260801 0.217446 0.200422 0.243207 0.247045 0.239188
chargesum: 0.00000
title: Mulliken charges with hydrogens summed into heavy atoms:
elementType: S O O O N C C C C
charge: 1.144680 -0.404053 -0.507508 -0.508458 -0.227168 0.212147 0.021477 0.024118 0.244763
polarizability: 1.16793931e+02 4.03279079e+00 8.40291586e+01 -2.03483890e+00 6.08480917e-01 7.54549234e+01
1716.lowfreq: -9.9338 -0.0029 -0.0024 0.0006 7.8161 13.3662 26.0962 57.0921 77.4502
frequency: 24.6122 57.0875 77.3884 107.5561 124.7489 151.4205 202.2219 227.4173 234.2775 246.8011 275.4084 314.9807 344.5491 380.8598 419.7990 434.8845 474.5578 506.0955 747.6241 832.5316 861.9939 922.5570 928.6555 933.7594 944.9267 976.2031 1104.2782 1110.4725 1132.7474 1145.1052 1164.2314 1289.5675 1310.6626 1379.9038 1391.1043 1401.8249 1407.3749 1438.3112 1460.5991 1464.8790 1474.4362 1476.2403 1483.7171 2973.0181 2980.3901 2985.8946 3031.0571 3074.5543 3081.0405 3084.6616 3095.7475 3097.2668 3109.1078 3439.8986
redmass: 2.8364 3.6601 3.7825 1.1942 2.9324 4.5192 1.0303 4.6836 1.3434 3.2852 4.0937 3.1619 5.7223 2.9154 1.8405 3.7611 5.2942 11.6374 2.5349 2.6848 8.5200 8.1718 1.2649 1.8965 1.6151 11.9461 1.3479 1.2624 2.1059 2.2536 1.8313 1.2270 1.3878 1.1914 1.1931 1.1866 1.1209 1.0493 1.0473 1.0492 1.0517 1.0525 1.0529 1.0277 1.0363 1.0367 1.0850 1.0994 1.1060 1.0981 1.1029 1.1005 1.1003 1.0760
irintensity: 1.8520 3.3778 0.9075 0.9380 9.8230 3.8022 0.0352 5.2229 0.6148 10.0381 4.5976 27.9292 14.6283 2.0299 10.9099 31.8481 32.6031 182.1158 22.9991 4.1765 135.0054 72.6239 3.7482 7.4702 8.8819 69.0352 18.2868 0.8651 23.2119 72.6910 12.6743 4.9880 4.2526 16.2638 23.4309 4.0789 2.3137 14.8951 4.9071 3.6703 25.4194 16.2983 13.1921 42.6884 15.4827 28.7775 0.7780 1.1912 22.6828 60.3405 11.5448 13.1736 20.6499 29.8044
temp: 298.150 k
press: 1.00000 atm
elementType: 16 8 8 8 7 6 6 6 6 1 1 1 1 1 1 1 1 1 1 1
symmnumber: 1
zpe: 408770.0 jmol-1
zpe.correction: 0.155692 hartree
zpe.thermalcorrener: 0.168374 hartree
zpe.thermalcorrenthalpy: 0.169318 hartree
zpe.thermalcorrgfe: 0.116059 hartree
zpe.sumelectzpe: -836.551683 hartree
zpe.sumelectthermal: -836.539001 hartree
zpe.sumelectthermalent: -836.538057 hartree
zpe.sumelectthermalfe: -836.591317 hartree
dipole: -2.1086 3.2582 -1.4385
dipole: 4.1390
quadrupole: -52.5615 -67.8441 -65.5824
quadrupole: 6.1539 0.8355 0.0978
quadrupole: 9.4345 -5.8481 -3.5864 6.1539 0.8355 0.0978
hfenergy: -836.7073755 hartree
pointgroup: C01 [X(C4H11N1O3S1)]
dipole: -0.8306174 1.2327094 -0.6650231 debye
dipolederiv: 1.8751796 -0.0394366 0.0747102 0.1808641 1.6395289 -0.0536782 0.0967824 -0.1161914 1.354508 -0.9636316 -0.1572602 -0.0351447 -0.3530248 -0.6822629 -0.0056422 0.0253487 0.0480799 -0.4505311 -0.562401 0.0103285 0.0397073 0.0083346 -0.5001215 0.0069743 0.006066 0.0967793 -0.6439 -0.6271444 0.095976 0.0153824 0.0719636 -0.6205577 -0.0160113 0.0785046 -0.1125659 -0.513762 -0.620313 0.0884543 -0.0442908 0.1889592 -0.7051349 -0.0673479 -0.1531535 -0.0959601 -0.357143 0.3871919 -0.0920489 -0.067334 -0.3351065 0.4297203 0.0136891 -0.4483583 0.0767303 0.0856153 -0.1141046 -0.0353747 -0.016497 0.1392675 -0.0156747 -0.0167266 0.165468 -0.0198786 0.1246654 -0.0798753 -0.0520596 0.0038405 0.0223934 -0.1930019 -0.0049813 0.0675365 0.0027008 0.10787 0.5775505 0.2175485 0.0128617 -0.162564 0.0673851 0.0351357 0.1773586 0.1260338 0.2403175 0.0802047 0.0073967 -0.063022 0.024338 0.0317946 0.0346398 0.0088439 0.0222062 -0.0326943 0.0495676 0.0597701 -0.0156222 0.0573014 0.2803712 0.1038665 0.1120863 0.0412801 0.1318283 -0.1303965 0.058923 0.0577631 0.0608246 0.0560147 -0.0684295 0.0670878 -0.0572674 0.0382076 0.0876391 -0.0168396 0.0131771 -0.0070438 0.0838521 0.0597569 -0.0700449 0.019763 -0.1485991 0.1181585 0.0029956 -0.0125864 -0.0420161 -0.1241129 0.0369975 -0.0124116 0.0409169 0.0878601 -0.0186981 -0.1056421 -0.0429552 -0.0754567 0.0518705 -0.0063996 -0.0558376 0.0034081 0.074892 -0.0496456 0.1088159 0.096997 0.1140907 0.0309063 -0.0300333 0.1084452 -0.0586601 0.0220287 0.0889953 0.0143105 -0.0422335 -0.0077736 0.0539315 -0.0132277 -0.0572575 0.0619026 -0.145559 -0.0267501 -0.0993568 0.0044315 -0.0472504 -0.0373752 0.0753958 -0.0324261 0.0531058 0.104531 -0.046534 -0.0072987 0.037325 0.1407767 0.0367707 -0.0918544 0.0329043 -0.0911825 0.0423521 -0.024993 -0.0592018 -0.0165099 0.0211221 0.1160956 0.0078763 -0.1169429 -0.0412009 -0.1224875 unknown
polarizability: 116.7838138|4.1535562|84.1389379|-1.7279008|0.0498239|75.3552616 unknown
InChI: InChI=1S/C4H11NO3S/c1-4(2)5-9(6,7)8-3/h4-5H,1-3H3
charge 0 multiplicity 1
20 atoms
S  0.849423 -0.636624 0.210358
O  1.431486 1.100581 -0.284867
O  0.717994 -0.710101 1.815317
O  1.752056 -1.692336 -0.607979
N  -0.798394 -0.619834 -0.473951
C  -1.869316 0.122539 0.256204
C  -3.205912 -0.530967 -0.160828
C  -1.84456 1.646013 -0.001401
C  2.881093 1.295739 -0.079204
H  -1.689934 -0.076337 1.328935
H  -0.743566 -0.47344 -1.494584
H  -4.036955 -0.05709 0.391876
H  -3.397476 -0.394289 -1.241789
H  -3.198112 -1.610718 0.060025
H  -0.859874 2.072381 0.25568
H  -2.617453 2.145698 0.610013
H  -2.054063 1.86926 -1.064868
H  3.07834 2.298304 -0.496484
H  3.468637 0.540386 -0.632113
H  3.140886 1.280438 0.99486
