program: Gaussian 09
title: 000151823
version: EM64L-G09RevD.01
frameworkgroup: C1[X(C5H5N3O2)]
method: RPBEPBE
basis: SDD
operation: Freq
keyword: #pfreq=noraman
keyword: PBEPBE/SDD
title: #p freq=noraman PBEPBE/SDD
converged: NO NO NO NO
title: Mulliken charges:
elementType: O O N N N C C C C C H H H H H
charge: -0.233467 -0.277394 -0.327698 -0.018457 -0.619286 0.116209 -0.210935 0.163703 -0.372954 0.175646 0.303284 0.351810 0.257425 0.336921 0.355193
chargesum: 0.00000
title: Mulliken charges with hydrogens summed into heavy atoms:
elementType: O O N N N C C C C C
charge: -0.233467 -0.277394 0.024112 -0.018457 0.072828 0.116209 0.092349 0.163703 -0.115528 0.175646
polarizability: 1.29421169e+02 -2.24184197e+00 8.60328828e+01 1.14178719e-03 1.39850370e-03 3.25066581e+01
1716.lowfreq: -0.0014 -0.0012 -0.0008 7.6315 12.4040 12.4453 93.8101 102.6014 180.1023
frequency: 93.7885 102.5975 180.1023 252.4448 338.2195 404.9109 406.7174 483.9103 499.6893 546.4825 585.8057 616.6773 676.7504 694.8296 710.7926 776.7938 788.6974 796.1981 899.7393 938.4965 946.0663 1063.4218 1111.1834 1175.9035 1221.1419 1280.2633 1355.0517 1378.1499 1417.5519 1491.3715 1560.8687 1586.9325 1634.2947 1641.4701 3155.1714 3180.1727 3492.7109 3502.2345 3667.7660
redmass: 9.4709 5.5703 5.7959 5.6303 6.4571 6.3494 3.6922 3.0855 4.8553 5.3409 1.2397 8.4043 1.0842 3.5101 4.7809 6.1015 1.5065 6.5380 1.4986 1.3713 3.7675 2.0161 2.6628 2.9582 2.7361 1.5326 1.8991 3.8267 2.2769 8.4268 1.4091 4.8077 4.7602 6.7076 1.0926 1.0959 1.0461 1.0782 1.1032
irintensity: 11.7674 8.6572 18.8402 10.7461 2.2013 13.3635 4.6865 43.4934 2.1371 29.5248 96.8593 0.6882 112.3335 94.3941 1.4538 7.6968 108.3427 15.1101 9.9597 1.7664 5.9825 0.1116 5.1653 49.5165 49.7181 0.3527 16.1966 167.4659 21.7552 12.7228 218.2917 0.7196 430.5698 308.6325 4.0432 1.8133 55.5028 59.2128 76.5080
temp: 298.150 k
press: 1.00000 atm
elementType: 8 8 7 7 7 6 6 6 6 6 1 1 1 1 1
symmnumber: 1
zpe: 279061.1 jmol-1
zpe.correction: 0.106289 hartree
zpe.thermalcorrener: 0.114505 hartree
zpe.thermalcorrenthalpy: 0.115449 hartree
zpe.thermalcorrgfe: 0.072972 hartree
zpe.sumelectzpe: -507.533411 hartree
zpe.sumelectthermal: -507.525194 hartree
zpe.sumelectthermalent: -507.524250 hartree
zpe.sumelectthermalfe: -507.566728 hartree
dipole: -0.7362 -0.3376 0.0001
dipole: 0.8099
quadrupole: -72.6117 -49.0710 -58.4744
quadrupole: 14.0257 0.0002 0.0005
quadrupole: -12.5594 10.9814 1.5780 14.0257 0.0002 0.0005
hfenergy: -507.6396996 hartree
pointgroup: C01 [X(C5H5N3O2)]
dipole: -0.2853845 0.1417405 -0.0000262 debye
dipolederiv: -1.4496134 -0.0582543 -0.0000108 0.1211613 -0.3515361 -0.0000023 0.0000393 0.0000019 -0.3815629 -0.9073885 -0.2575283 -0.0000085 -0.2004958 -0.8589714 -0.0000161 0.0000013 0.0000057 -0.3788687 -0.7795588 0.3963279 0.0000165 -0.5709693 -0.2484069 0.0000076 -0.0000242 0.0000009 -0.2792591 0.0914083 0.2187693 -0.0000055 0.3628799 -0.0171643 -0.0000023 -0.0000064 0.0000019 -0.1886611 -0.687898 0.4197329 0.0000005 0.3723985 -0.9873723 -0.0000056 -0.0000093 -0.0000078 -0.6811766 -0.4490414 0.231841 0.0000114 -0.2746265 -0.4542335 -0.0000081 0.0000038 -0.0000273 -0.0181426 0.4193516 -0.6056989 -0.0000215 -0.0031072 0.2795097 0.0000123 -0.0000123 0.0000216 0.041829 1.7378017 0.1385264 0.0000143 0.0556874 0.2168538 0.0000028 -0.0000141 -0.0000038 0.2894388 -0.4301386 -0.1317992 -0.0000005 0.4878897 0.2806976 0.000001 0.0000172 0.0000289 -0.0480726 1.6064535 -0.1702103 -0.0000012 -0.1444248 1.3984681 0.0000311 0.0000038 0.000015 0.2323739 0.1334738 -0.0362163 -0.0000014 -0.0310131 0.0674064 -0.0000056 -0.0000028 -0.0000066 0.1781064 0.1551748 -0.010411 0.0000007 -0.0449782 0.2367794 -0.0000048 -0.0000014 -0.0000045 0.335418 0.0265928 -0.0580763 -0.0000002 -0.0452586 0.0028203 -0.0000025 -0.0000088 -0.000014 0.1306261 0.2059922 -0.0467742 0.0000015 -0.0238542 0.2007246 -0.0000048 0.0000065 -0.0000079 0.3925436 0.3273901 -0.0302287 0.0000045 -0.0612891 0.2344246 -0.0000027 0.0000073 -0.000004 0.3754077 unknown
polarizability: 129.5183748|0.8937688|85.9356772|-0.0010979|0.0014332|32.5066581 unknown
InChI: InChI=1S/C5H5N3O2/c6-5(10)3-1-8-4(9)2-7-3/h1-2,8H,6H2
charge 0 multiplicity 1
15 atoms
O  3.443227 -0.014887 -0.000026
O  -2.830165 -1.137029 0.000007
N  1.411812 -1.199489 -0.00004
N  -0.006403 1.199456 0.000062
N  -2.73384 1.207501 0.000045
C  -0.66937 -0.03558 0.000038
C  0.034915 -1.232747 -0.000029
C  2.177736 0.010692 0.000011
C  1.322644 1.213453 0.000021
C  -2.171944 -0.048105 0.000004
H  -0.485372 -2.193713 -0.000076
H  1.955549 -2.069887 -0.000091
H  1.84163 2.177877 0.000057
H  -3.747435 1.303237 0.000069
H  -2.113982 2.020622 0.000049
