program: Gaussian 09
title: 000151815
version: EM64L-G09RevD.01
frameworkgroup: C1[X(C8H14O2)]
method: RPBEPBE
basis: SDD
operation: Freq
keyword: #pfreq=noraman
keyword: PBEPBE/SDD
title: #p freq=noraman PBEPBE/SDD
converged: YES YES NO NO
title: Mulliken charges:
elementType: O O C C C C C C C C H H H H H H H H H H H H H H
charge: -0.417096 -0.230727 -0.551058 0.636798 -0.572443 -0.366863 -0.496960 -0.684973 -0.788980 0.184009 0.198257 0.208928 0.232599 0.232386 0.217975 0.201751 0.256790 0.269845 0.207555 0.212586 0.220924 0.225518 0.226642 0.376536
chargesum: 0.00000
title: Mulliken charges with hydrogens summed into heavy atoms:
elementType: O O C C C C C C C C
charge: -0.040560 -0.230727 -0.143873 0.636798 -0.107458 0.052863 0.029676 -0.043908 -0.336819 0.184009
polarizability: 1.01480905e+02 6.60164272e+00 9.97089554e+01 -3.80111205e+00 1.95749640e+00 7.64469053e+01
1716.lowfreq: -13.9161 -0.0010 -0.0010 -0.0003 8.5016 9.8879 12.4666 33.5347 73.9038
frequency: 11.5350 33.1403 73.8701 80.2685 109.5113 139.0193 191.1097 213.8803 238.8371 317.9386 382.4906 435.7581 477.0177 507.8037 558.9659 590.2925 640.2701 706.5453 744.4141 781.0294 819.5862 865.2969 882.8725 907.1962 950.7713 976.9519 1014.9874 1033.7446 1053.3968 1077.5322 1092.6725 1097.4402 1159.8928 1225.0296 1237.8987 1269.1380 1279.0007 1284.8412 1299.5342 1307.4755 1341.2997 1365.7320 1390.3844 1434.8623 1441.8554 1469.5405 1470.9391 1476.0365 1476.8073 1487.4951 1661.1184 1669.6124 2951.7073 2972.8858 2980.7657 2992.3155 3000.4141 3015.3650 3038.5883 3042.5184 3067.6997 3071.3173 3074.6668 3084.3212 3187.0129 3511.3526
redmass: 9.5762 3.5591 1.6054 2.5200 2.7570 3.5022 2.6669 1.4403 2.3325 2.7257 3.9077 2.5507 2.5217 1.8198 3.7517 3.5251 1.3234 1.1318 1.1141 1.4151 2.9634 1.7705 1.7343 2.0945 1.3533 1.7245 1.9557 2.9689 2.6808 2.1757 1.6407 2.0908 1.2244 1.4169 1.4321 1.2433 1.3140 1.1374 1.6431 2.0537 1.4696 1.8084 1.2130 1.1529 1.0959 1.0883 1.0819 1.0436 1.0593 1.0899 5.2761 8.0966 1.0642 1.0358 1.0608 1.0627 1.0613 1.0944 1.1012 1.0966 1.1000 1.1011 1.0993 1.0628 1.1138 1.0639
irintensity: 0.9736 0.0138 0.0888 0.4433 0.6384 1.1190 0.0869 0.7360 1.3281 0.3090 4.5472 5.0935 20.2371 28.7676 6.6741 33.4416 129.3992 1.7932 5.6187 11.2049 7.7561 2.5826 3.7030 5.5353 67.1365 22.8931 17.1286 172.0876 0.5155 84.7625 7.1896 6.1041 1.4732 1.2389 3.3351 1.0748 0.7189 0.2966 47.6495 10.5940 1.8473 40.8615 10.7123 4.8573 27.4675 3.7958 22.7042 12.8765 4.9206 12.9541 36.3492 207.2117 22.5836 42.6261 25.1412 9.4302 22.5188 8.1422 25.4973 0.9307 35.2722 77.0768 49.6146 8.2124 25.8253 19.0815
temp: 298.150 k
press: 1.00000 atm
elementType: 8 8 6 6 6 6 6 6 6 6 1 1 1 1 1 1 1 1 1 1 1 1 1 1
symmnumber: 1
zpe: 536797.7 jmol-1
zpe.correction: 0.204455 hartree
zpe.thermalcorrener: 0.216554 hartree
zpe.thermalcorrenthalpy: 0.217499 hartree
zpe.thermalcorrgfe: 0.163616 hartree
zpe.sumelectzpe: -462.884070 hartree
zpe.sumelectthermal: -462.871971 hartree
zpe.sumelectthermalent: -462.871027 hartree
zpe.sumelectthermalfe: -462.924909 hartree
dipole: 0.6278 -0.8124 -1.2729
dipole: 1.6354
quadrupole: -57.6806 -60.5431 -67.8162
quadrupole: 1.8980 3.5380 -0.9207
quadrupole: 4.3327 1.4702 -5.8029 1.8980 3.5380 -0.9207
hfenergy: -463.0885257 hartree
pointgroup: C01 [X(C8H14O2)]
dipole: -0.2396927 -0.3208206 0.5035704 debye
dipolederiv: -0.7800292 0.2938072 -0.4593255 0.277843 -0.6299863 0.2767246 -0.4235516 0.254209 -0.673701 -0.6645718 0.0730723 0.2346049 0.1450373 -0.3891046 0.0977318 0.0134773 0.1921167 -0.9034481 0.02615 -0.0723763 0.0358172 -0.1115278 -0.0649363 -0.0213193 0.0706771 -0.0637731 0.0839775 0.247714 -0.0115941 -0.1113518 -0.0045944 0.3340132 0.0012095 -0.2219875 -0.030215 -0.0681666 0.0104396 0.0020454 0.0447487 0.0415904 0.0327686 0.0145382 0.0975904 0.0263134 0.0718645 0.1335973 -0.0631646 0.0269588 -0.0469205 0.0943806 -0.0089746 0.0505942 0.0720091 0.0861969 -0.274834 0.1560754 0.1150805 0.0735321 0.1081887 0.0434292 0.2819043 -0.0516585 -0.0695661 0.0339959 -0.0734531 0.0148803 -0.0786805 -0.0174445 0.0108715 -0.0053127 -0.0317935 0.0649611 -0.1117132 0.0568326 -0.1907541 0.0426983 -0.2513664 -0.0513203 -0.1422557 -0.0372845 -0.3550017 1.3002969 -0.4624913 0.0190556 -0.4857599 0.4944487 -0.3820132 0.0849783 -0.3948405 1.312144 0.0338944 0.0229075 -0.1016255 0.0535561 -0.0484464 0.104803 -0.0962228 0.0923758 -0.0596411 -0.1314239 0.0450409 0.0948504 0.0812021 0.0188054 -0.0603016 0.0553595 -0.0368867 0.0305077 0.0674812 0.033942 -0.0278179 0.015041 0.0018227 -0.1068346 -0.0517707 -0.0927132 -0.043517 -0.0093754 -0.0671119 0.0273096 -0.1017214 -0.0730235 0.064017 -0.0023053 0.045385 0.0643652 0.0244395 0.0178946 -0.0771714 0.0334858 -0.0141811 0.1091555 -0.075335 0.0684333 -0.0819845 -0.1321034 0.0705374 0.0992084 0.0782644 0.0174048 -0.0424726 0.0838395 -0.035825 0.0175686 0.0795609 -0.0629049 0.0361731 -0.0508448 -0.0524835 0.0504342 0.006798 0.0484618 0.0801017 0.0662817 -0.0018358 -0.0310291 0.0018385 0.0592984 -0.0804896 -0.0745181 -0.0438 -0.0222231 0.0252715 0.0680704 -0.0999687 0.0294747 0.0146375 0.0923208 -0.0582975 0.134083 -0.0662324 -0.1108752 0.0479622 0.0823827 0.1147724 0.0305746 -0.0441117 0.1037212 -0.0092912 0.0551608 0.0525216 -0.0797204 -0.0365942 -0.0929269 -0.0716608 -0.1126252 -0.0626135 -0.1391869 -0.0425265 -0.0848382 0.0634203 0.1082774 0.0341727 0.0687608 0.0013873 0.1196847 -0.0246205 0.1427146 0.0116523 -0.1100524 0.0854894 -0.0852982 -0.0312417 0.0372605 0.0876977 0.070762 0.1538364 0.1864672 0.0530967 0.1108012 0.0357654 0.3687712 0.0065798 0.1578483 -0.0122604 0.222609 unknown
polarizability: 101.4540071|-6.6150833|99.6455282|-4.078541|-1.9001201|76.5372301 unknown
InChI: InChI=1S/C8H14O2/c1-3-4-7(2)5-6-8(9)10/h9H,2-6H2,1H3
charge 0 multiplicity 1
24 atoms
O  3.311225 -1.039043 0.872465
O  2.910452 -0.178947 -1.2463
C  -1.987638 0.071344 0.582179
C  -1.062284 1.190245 0.114737
C  0.28943 0.798312 -0.474035
C  -2.382496 -0.937947 -0.531336
C  1.166631 -0.008167 0.51171
C  -3.343773 -2.028455 -0.011836
C  -1.43164 2.49639 0.202679
C  2.509838 -0.385791 -0.080474
H  -1.511808 -0.496908 1.410133
H  -2.910109 0.514376 1.004596
H  0.14938 0.194739 -1.391958
H  0.838094 1.704488 -0.786358
H  -2.854286 -0.385311 -1.367048
H  -1.474208 -1.418022 -0.946494
H  0.668026 -0.945235 0.826262
H  1.34579 0.563075 1.44229
H  -2.88109 -2.606645 0.810548
H  -4.278064 -1.581974 0.377496
H  -3.61694 -2.739377 -0.812742
H  -2.405434 2.792427 0.611033
H  -0.773614 3.305939 -0.135607
H  4.183417 -1.278112 0.45536
