program: Gaussian 09
title: 000151798
version: EM64L-G09RevD.01
frameworkgroup: C1[X(C13H11ClN4O2)]
method: RPBEPBE
basis: SDD
operation: Freq
keyword: #p
keyword: freq=noraman
keyword: PBEPBE/SDD
title: #p freq=noraman PBEPBE/SDD
converged: YES YES NO NO
title: Mulliken charges:
elementType: Cl O O N N N N C C C C C C C C C C C C C H H H H H H H H H H H
charge: -0.040511 -0.261185 -0.260165 -0.368557 -0.336989 0.001471 0.081978 -0.556793 0.470805 0.505443 0.309453 -0.299520 -0.305728 -0.351567 -0.476003 -0.192887 -0.197963 -0.118341 -0.189244 -0.324892 0.261925 0.232378 0.354057 0.280203 0.272129 0.263013 0.245266 0.260555 0.261960 0.234144 0.245565
chargesum: 0.00000
title: Mulliken charges with hydrogens summed into heavy atoms:
elementType: Cl O O N N N N C C C C C C C C C C C C C
charge: -0.040511 -0.261185 -0.260165 -0.014500 -0.336989 0.001471 0.081978 -0.062490 0.470805 0.505443 0.309453 -0.019317 -0.033599 -0.088554 -0.230736 0.067668 0.063997 -0.118341 0.044900 -0.079328
polarizability: 2.73181819e+02 2.48682098e+01 1.94350967e+02 -1.81151811e+01 7.14542618e-01 1.00340422e+02
1716.lowfreq: -7.1060 -1.0288 -0.0019 -0.0017 -0.0016 4.6787 11.8890 29.7591 31.9802
frequency: 11.8088 29.7051 31.9307 49.0756 62.5824 71.9417 121.3033 155.5075 168.5565 201.4914 224.2548 249.3889 266.4183 309.1720 326.4864 354.2134 363.8453 389.3955 409.6502 411.5367 423.6134 465.8626 501.1206 522.7632 596.3484 608.5846 625.7767 634.5740 700.9466 711.2939 713.4484 725.5954 775.3723 785.7122 796.7669 811.3139 816.8990 838.8473 901.3956 919.1775 927.4699 945.2073 953.4162 954.2363 982.1820 998.1385 1001.4847 1010.2199 1026.7417 1046.9966 1075.8927 1116.3946 1118.3295 1169.8149 1186.7306 1193.9631 1228.8984 1252.2344 1257.0760 1294.5402 1312.6553 1333.9584 1343.9142 1351.2329 1381.1992 1401.0474 1418.7148 1451.6748 1461.3410 1473.4397 1506.2703 1559.2433 1585.7830 1587.0729 1595.5500 1654.7995 3020.6186 3083.2353 3108.4816 3133.0200 3144.9792 3164.4769 3167.4531 3170.2131 3182.9311 3198.5606 3314.6306
redmass: 6.6693 6.2789 5.4294 7.4620 5.9727 7.8421 8.0385 6.0447 6.1667 7.4761 7.9128 10.0261 8.1238 3.6760 4.5413 7.0817 5.1338 3.1988 3.6943 3.2797 7.1029 6.8781 4.9728 3.5310 7.1996 6.6919 7.0672 6.0693 5.3444 5.5362 7.0968 1.9723 3.5666 1.7211 1.6027 1.2946 1.5749 2.1473 4.8876 3.5783 1.4624 1.5745 1.3740 1.4733 2.5231 1.7570 2.5806 3.4496 3.2927 5.0367 2.5815 1.3264 1.5978 2.9001 1.1182 1.5480 2.0001 4.0903 1.4012 1.2845 5.3539 6.8565 1.2177 1.3163 8.9501 3.2901 2.0375 1.2697 1.7115 2.3796 1.5930 5.5165 5.7591 7.9436 6.3762 8.8150 1.0592 1.1049 1.0913 1.0881 1.0927 1.0891 1.1002 1.0907 1.0976 1.0962 1.0826
irintensity: 0.5978 1.0935 1.7530 0.3338 0.0244 5.2904 2.3876 1.0887 1.7821 0.9372 1.7248 1.5277 9.7284 9.2945 9.5949 2.9505 22.9075 1.1924 3.8642 5.1938 1.9071 22.3062 8.3755 35.8098 14.3322 13.6423 6.2021 4.4927 4.9819 8.1485 2.7352 43.7153 13.3606 29.9613 87.4971 12.9988 68.3964 20.7688 152.8267 97.9382 4.5923 43.5319 3.1995 3.4358 15.0196 16.3052 14.7408 16.5196 0.5396 11.5097 50.3877 20.3992 6.4892 61.4321 2.5755 4.5090 11.9198 21.6594 9.4826 3.1742 4.7673 204.1411 4.9201 4.7355 19.0874 11.1674 22.5882 31.9323 3.5893 144.6508 283.9845 4.6529 2.6844 2.4974 35.1275 181.4329 28.6685 3.3993 22.8790 6.0370 9.4414 2.1060 19.9556 1.3101 0.8667 0.3906 143.4110
temp: 298.150 k
press: 1.00000 atm
elementType: 17 8 8 7 7 7 7 6 6 6 6 6 6 6 6 6 6 6 6 6 1 1 1 1 1 1 1 1 1 1 1
symmnumber: 1
zpe: 585752.3 jmol-1
zpe.correction: 0.223101 hartree
zpe.thermalcorrener: 0.240678 hartree
zpe.thermalcorrenthalpy: 0.241623 hartree
zpe.thermalcorrgfe: 0.173915 hartree
zpe.sumelectzpe: -1330.019170 hartree
zpe.sumelectthermal: -1330.001593 hartree
zpe.sumelectthermalent: -1330.000649 hartree
zpe.sumelectthermalfe: -1330.068356 hartree
dipole: -0.2100 -0.6112 1.3541
dipole: 1.5004
quadrupole: -139.6811 -114.7471 -128.0562
quadrupole: -7.1945 5.7543 10.1406
quadrupole: -12.1863 12.7477 -0.5614 -7.1945 5.7543 10.1406
hfenergy: -1330.2422715 hartree
pointgroup: C01 [X(C13H11Cl1N4O2)]
dipole: -0.058444 0.1202411 -0.5749667 debye
polarizability: 268.6782603|-25.0614859|193.0820855|26.4148354|-22.1666343|106.1128623 unknown
InChI: InChI=1S/C13H11ClN4O2/c14-11-3-5-12(6-4-11)18(17-20)13(19)16-9-10-2-1-7-15-8-10/h1-8,16H,9H2
charge 0 multiplicity 1
31 atoms
Cl -6.334749 1.914582 -0.378185
O  0.045202 0.266269 -1.377661
O  -0.10449 -2.637849 1.623977
N  1.244758 -1.38629 -0.238504
N  -1.037221 -0.944948 0.367239
N  5.430427 0.350207 0.891818
N  -1.142574 -1.912214 1.40336
C  2.48366 -1.193125 -1.026077
C  3.419773 -0.146082 -0.432553
C  -2.288045 -0.244836 0.152799
C  0.135445 -0.628212 -0.493428
C  3.188949 1.241646 -0.616979
C  -2.317396 1.161047 -0.00924
C  -3.490617 -0.992152 0.159258
C  4.5558 -0.530829 0.322773
C  -3.553205 1.818872 -0.175148
C  -4.729114 -0.336073 0.003837
C  -4.741499 1.062113 -0.163473
C  4.082494 2.167832 -0.037097
C  5.182068 1.6807 0.708511
H  2.187761 -0.901153 -2.048698
H  2.992981 -2.171517 -1.0777
H  1.186098 -2.081102 0.525335
H  2.324737 1.575806 -1.201636
H  -1.390281 1.736586 -0.017342
H  -3.457863 -2.077929 0.281761
H  4.784092 -1.593291 0.481473
H  -3.588256 2.903854 -0.305166
H  -5.66282 -0.904919 0.005357
H  3.937507 3.245682 -0.160561
H  5.896377 2.368326 1.175449
