program: Gaussian 09
title: 000151773
version: EM64L-G09RevD.01
frameworkgroup: C1[X(C10H19BrO2)]
method: RPBEPBE
basis: SDD
operation: Freq
keyword: #p
keyword: freq=noraman
keyword: PBEPBE/SDD
title: #p freq=noraman PBEPBE/SDD
converged: YES YES NO NO
title: Mulliken charges:
elementType: Br O O C C C C C C C C C C H H H H H H H H H H H H H H H H H H H
charge: -0.049920 -0.238541 -0.248062 0.282003 -0.373164 -0.366699 0.022243 -0.436016 -0.695485 -0.732685 -0.371408 -0.304001 -0.697804 0.185593 0.231516 0.229939 0.186085 0.182102 0.216282 0.228495 0.257771 0.204096 0.203441 0.210792 0.220067 0.220692 0.234539 0.185603 0.224015 0.230546 0.277061 0.280903
chargesum: 0.00000
title: Mulliken charges with hydrogens summed into heavy atoms:
elementType: Br O O C C C C C C C C C C
charge: -0.049920 -0.238541 -0.248062 0.282003 0.043945 0.049324 0.204345 0.008762 -0.030176 -0.081134 0.048734 0.150560 -0.139840
polarizability: 1.81736931e+02 6.61082780e+00 1.05139419e+02 6.79173619e+00 2.73691436e+00 1.02289251e+02
1716.lowfreq: -5.9720 -0.0006 0.0003 0.0006 3.3229 8.9897 29.4781 45.5538 48.7016
frequency: 27.7556 45.4330 48.5468 85.2187 108.7706 122.5000 136.5449 182.6962 193.1338 210.8805 224.9832 250.7642 281.4064 296.5146 342.9581 378.4557 400.0892 411.7638 481.2575 496.4855 542.3781 615.6021 635.8985 738.2019 757.1335 772.4466 810.9890 878.3681 901.2185 906.4244 923.3167 941.7485 944.2343 956.1358 988.2646 1018.0412 1027.4701 1035.1192 1038.2978 1052.2326 1077.9546 1097.3004 1158.1938 1186.3674 1197.7628 1206.7524 1214.4933 1240.5164 1261.0431 1272.7634 1285.0217 1288.8838 1303.1226 1315.0754 1317.5851 1342.2503 1349.3588 1359.0628 1376.6600 1381.3240 1398.9756 1447.4178 1449.2663 1453.3865 1454.2321 1466.1831 1469.9313 1471.4314 1480.4994 1484.9345 1489.2038 2865.6104 2921.2059 2931.5659 2967.5082 2968.7567 2980.0825 2995.6237 3004.9430 3032.2672 3047.7127 3056.6919 3060.2627 3065.4574 3066.6908 3073.3941 3075.5137 3075.9273 3100.6983 3133.0813
redmass: 4.7905 3.3145 2.7143 3.0588 4.5195 2.1153 3.3011 1.0203 2.8311 3.6915 1.3669 3.1338 2.3064 2.7737 2.7283 2.7114 1.9320 2.5210 4.5178 4.2655 3.8595 5.0263 3.9910 1.1762 1.3547 3.5873 1.7361 3.1342 2.1698 1.5823 2.0694 1.4761 1.4346 5.9391 3.2824 1.4586 1.9333 2.4137 2.0545 3.0697 2.4743 1.8618 1.7246 2.1471 1.2913 1.8055 1.2353 1.4241 1.3263 2.0311 1.1883 1.0662 1.6019 1.2071 1.3146 1.3662 1.2844 1.3326 1.2827 1.6347 1.2144 1.0809 1.0992 1.0825 1.0877 1.0486 1.0750 1.0678 1.0578 1.0989 1.0602 1.0826 1.0677 1.0678 1.0359 1.0633 1.0369 1.0599 1.0600 1.0955 1.0563 1.1035 1.0988 1.0991 1.0979 1.0968 1.1036 1.0962 1.0983 1.1112
irintensity: 0.1791 0.5369 0.6343 0.9466 1.0449 0.1447 1.1814 0.0487 1.2756 4.5329 0.2796 6.3645 0.3807 5.0060 0.8485 7.9676 3.3873 7.5751 4.7096 2.0050 4.3220 36.2240 0.7666 4.6865 16.4611 3.0166 15.0314 12.2946 40.0756 21.3690 1.8004 20.6415 15.2560 9.3240 37.4553 0.9381 2.0491 12.8742 12.9731 142.2265 8.3240 51.0854 22.6305 1.7464 1.1697 2.0113 14.1770 1.6070 31.7676 6.8486 2.7555 1.8270 31.3345 3.4945 15.1288 0.4857 7.6068 3.2387 15.5552 37.6053 18.8862 8.1989 3.1187 1.4411 3.8718 1.2012 1.3280 16.1061 10.8692 16.1025 23.4145 70.9019 24.6267 119.1262 39.0874 29.0751 29.3853 11.9845 25.8126 1.8451 24.1739 5.1966 25.4869 0.5586 3.5544 74.2492 56.5393 51.3647 19.1124 18.2984
temp: 298.150 k
press: 1.00000 atm
elementType: 35 8 8 6 6 6 6 6 6 6 6 6 6 1 1 1 1 1 1 1 1 1 1 1 1 1 1 1 1 1 1 1
symmnumber: 1
zpe: 723319.8 jmol-1
zpe.correction: 0.275498 hartree
zpe.thermalcorrener: 0.290820 hartree
zpe.thermalcorrenthalpy: 0.291764 hartree
zpe.thermalcorrgfe: 0.230980 hartree
zpe.sumelectzpe: -555.287679 hartree
zpe.sumelectthermal: -555.272357 hartree
zpe.sumelectthermalent: -555.271413 hartree
zpe.sumelectthermalfe: -555.332197 hartree
dipole: -4.5498 -1.0220 -2.0664
dipole: 5.1005
quadrupole: -95.0229 -92.0995 -88.7033
quadrupole: 2.0082 1.4615 -0.1272
quadrupole: -3.0810 -0.1576 3.2386 2.0082 1.4615 -0.1272
hfenergy: -555.5631771 hartree
pointgroup: C01 [X(C10H19Br1O2)]
dipole: 1.7646205 -0.3997799 0.8678244 debye
polarizability: 181.2729288|-6.2312565|105.1198354|9.3182818|-2.8909172|102.7728363 unknown
InChI: InChI=1S/C10H19BrO2/c1-10(2)7-12-9(13-8-10)5-3-4-6-11/h9H,3-8H2,1-2H3
charge 0 multiplicity 1
32 atoms
Br -6.467395 -0.110401 -0.442318
O  1.281458 1.460829 0.006671
O  0.676197 -0.8757 -0.119849
C  3.105023 -0.259255 -0.087191
C  2.645925 1.119096 0.461727
C  2.019496 -1.286991 0.334869
C  0.328548 0.436021 0.432576
C  -1.047128 0.829158 -0.090811
C  3.229663 -0.210868 -1.627918
C  4.453077 -0.645325 0.564214
C  -2.16066 -0.140107 0.363808
C  -3.544635 0.289947 -0.188215
C  -4.639524 -0.677547 0.262313
H  2.669519 1.109056 1.575743
H  3.288379 1.935916 0.093167
H  2.194991 -2.272632 -0.127694
H  2.014831 -1.399014 1.443695
H  0.363338 0.362235 1.54996
H  -1.260345 1.856888 0.258133
H  -0.99051 0.859534 -1.194731
H  2.265143 0.065386 -2.085251
H  3.987767 0.53325 -1.936382
H  3.535617 -1.195628 -2.028329
H  4.381004 -0.68009 1.668532
H  4.788593 -1.63963 0.21436
H  5.240849 0.08401 0.297997
H  -1.909513 -1.161318 0.020855
H  -2.196666 -0.172076 1.47281
H  -3.785279 1.312685 0.159024
H  -3.509983 0.323634 -1.293519
H  -4.764451 -0.702823 1.356186
H  -4.497629 -1.696439 -0.130532
