program: Gaussian 09
title: 000151772
version: EM64L-G09RevD.01
frameworkgroup: C1[X(C9H12N2O6)]
method: RPBEPBE
basis: SDD
operation: Freq
keyword: #p
keyword: freq=noraman
keyword: PBEPBE/SDD
title: #p freq=noraman PBEPBE/SDD
converged: YES YES NO NO
title: Mulliken charges:
elementType: O O O O O O N N C C C C C C C C C H H H H H H H H H H H H
charge: -0.259926 -0.467873 -0.440165 -0.443549 -0.320825 -0.238512 -0.188536 -0.397391 -0.195517 -0.137679 -0.073713 -0.049411 -0.363465 0.265883 -0.073184 -0.307204 0.147490 0.239902 0.225504 0.290686 0.288169 0.199591 0.219298 0.396670 0.376971 0.329145 0.363266 0.259418 0.354958
chargesum: 0.00000
title: Mulliken charges with hydrogens summed into heavy atoms:
elementType: O O O O O O N N C C C C C C C C C
charge: -0.259926 -0.071203 -0.063194 -0.088591 -0.320825 -0.238512 -0.188536 -0.034125 0.044385 0.087825 0.216973 0.238759 0.055423 0.265883 0.255961 -0.047787 0.147490
polarizability: 1.70510003e+02 1.11082823e+01 1.36409539e+02 6.11980796e+00 2.80160660e-01 7.87041114e+01
1716.lowfreq: -9.7962 -0.0009 -0.0007 -0.0006 8.8248 11.7662 39.3090 55.7857 69.4178
frequency: 39.2575 55.7595 69.4097 92.4214 119.9823 162.0755 178.5234 188.1489 195.2813 260.9431 270.3131 285.1846 299.9156 320.2424 369.2162 376.1294 387.1848 427.3091 478.2472 517.5361 519.4491 529.6738 574.9267 612.2877 670.1258 685.4505 686.7473 708.5537 725.0772 748.0368 775.2682 801.1311 818.3115 845.4588 875.9294 941.2232 962.9523 972.5388 988.0911 994.6624 1029.3745 1036.1087 1061.9294 1065.5390 1076.6107 1084.7085 1149.3589 1178.7326 1198.3937 1205.1420 1226.5269 1238.9766 1256.3960 1264.0434 1279.9877 1314.8297 1324.3141 1335.1372 1335.7541 1347.7483 1374.4860 1381.4559 1387.7255 1411.2914 1415.0761 1465.7976 1591.3050 1619.6966 1666.6272 2934.8364 2972.6890 2992.9103 2995.1362 3030.8868 3100.3224 3158.9266 3214.8044 3371.0011 3458.4822 3520.8514 3577.1036
redmass: 6.3337 7.2298 5.2927 7.2944 4.0146 6.3217 5.3649 7.8085 5.3411 5.6566 1.1551 4.6261 4.7502 8.6253 7.5430 4.8901 8.4487 3.4598 1.8470 1.6000 6.8115 5.5835 5.6309 5.7343 2.4634 1.7574 2.1963 2.2746 4.5888 7.9725 1.8978 3.6145 1.7267 4.7391 3.2712 3.1912 4.9622 2.0658 1.9896 1.6484 3.9001 5.0240 3.6056 3.8299 2.7277 2.5879 3.7919 1.1752 1.2162 2.2135 1.2733 1.2214 1.2343 1.6182 1.2392 1.4197 1.2819 1.5779 1.2987 1.3379 2.2762 1.6738 1.4934 2.5552 1.6013 1.0782 5.0511 8.7575 6.4369 1.0574 1.0852 1.0938 1.0950 1.0866 1.0886 1.0942 1.0961 1.0652 1.0647 1.0772 1.0668
irintensity: 0.9007 0.7442 9.4047 2.4692 5.9960 12.0201 3.5515 5.3103 7.6855 9.6726 157.5570 19.0946 2.3604 5.5837 3.9862 9.7749 13.0015 10.6416 122.6684 71.2357 18.1910 12.6337 34.1151 10.1041 69.1708 21.7340 75.0433 2.4335 13.6576 7.0312 71.4572 20.3230 101.0253 4.0402 6.3013 3.3635 59.9851 31.4362 29.4668 43.9000 60.5346 81.4994 65.7393 42.4792 61.8175 62.5370 32.2140 2.2366 29.0038 35.0306 17.7944 134.2757 2.0734 102.5956 8.8276 46.0477 25.7583 88.6691 17.8709 1.7362 43.2881 44.3985 135.5213 76.9021 13.7873 6.9761 85.8299 242.3619 700.9251 45.1630 17.0073 80.5557 53.3701 12.5257 14.6904 29.6310 0.5180 226.1941 42.8528 61.7440 8.1777
temp: 298.150 k
press: 1.00000 atm
elementType: 8 8 8 8 8 8 7 7 6 6 6 6 6 6 6 6 6 1 1 1 1 1 1 1 1 1 1 1 1
symmnumber: 1
zpe: 575284.2 jmol-1
zpe.correction: 0.219114 hartree
zpe.thermalcorrener: 0.234546 hartree
zpe.thermalcorrenthalpy: 0.235491 hartree
zpe.thermalcorrgfe: 0.176279 hartree
zpe.sumelectzpe: -909.707952 hartree
zpe.sumelectthermal: -909.692519 hartree
zpe.sumelectthermalent: -909.691575 hartree
zpe.sumelectthermalfe: -909.750787 hartree
dipole: -2.2080 2.2955 2.8894
dipole: 4.3004
quadrupole: -126.0109 -93.4160 -98.1550
quadrupole: -10.3448 -9.7324 8.1442
quadrupole: -20.1502 12.4446 7.7056 -10.3448 -9.7324 8.1442
hfenergy: -909.9270657 hartree
pointgroup: C01 [X(C9H12N2O6)]
dipole: -0.9942921 -0.8439505 -1.0778158 debye
polarizability: 167.5635721|-14.1243727|138.6993698|-9.6211907|0.2129943|79.3607114 unknown
InChI: InChI=1S/C9H12N2O6/c12-3-4-6(14)7(15)8(17-4)11-2-1-5(13)10-9(11)16/h1-2,4,6-8,10,12,14-15H,3H2
charge 0 multiplicity 1
29 atoms
O  -1.439183 -0.595733 1.151008
O  -1.449936 2.596431 -0.474286
O  -3.613834 1.429857 0.512952
O  -1.915894 -3.080149 -0.054584
O  1.285998 2.246106 -0.205866
O  4.605116 -1.039482 -0.557804
N  0.722988 0.025514 0.299824
N  2.919534 0.56969 -0.354992
C  -1.401772 1.150937 -0.539548
C  -2.845866 0.594992 -0.394483
C  -0.652942 0.515997 0.676723
C  -2.620754 -0.785776 0.251057
C  -2.36117 -1.888754 -0.785524
C  1.631655 1.023862 -0.09361
C  1.088834 -1.31589 0.405395
C  2.367163 -1.737867 0.125495
C  3.400142 -0.787991 -0.280509
H  -0.941323 0.803163 -1.486481
H  -3.350444 0.523437 -1.380017
H  -0.532342 1.25798 1.487711
H  -3.451111 -1.06546 0.917287
H  -1.590011 -1.570003 -1.520866
H  -3.310613 -2.076005 -1.330924
H  -0.497559 2.89961 -0.393246
H  -3.244624 2.352891 0.425745
H  0.280798 -1.98463 0.719598
H  3.601348 1.27994 -0.642235
H  2.643839 -2.788825 0.21039
H  -1.938338 -3.865543 -0.65641
