program: Gaussian 09
title: 000151691
version: EM64L-G09RevD.01
frameworkgroup: C1[X(C4H8ClN)]
method: RPBEPBE
basis: SDD
operation: Freq
keyword: #p
keyword: freq=noraman
keyword: PBEPBE/SDD
title: #p freq=noraman PBEPBE/SDD
converged: NO YES NO NO
title: Mulliken charges:
elementType: Cl N C C C C H H H H H H H H
charge: -0.095767 -0.298385 -0.382178 -0.615711 0.138296 -0.578022 0.205171 0.224812 0.274299 0.193164 0.228522 0.224289 0.248965 0.232545
chargesum: 0.00000
title: Mulliken charges with hydrogens summed into heavy atoms:
elementType: Cl N C C C C
charge: -0.095767 -0.024086 0.047805 0.030264 0.138296 -0.096512
polarizability: 6.88942553e+01 4.56339509e+00 7.00721400e+01 -3.68955911e+00 -1.25932273e+00 3.89087506e+01
1716.lowfreq: -10.6062 -4.2036 -0.0032 -0.0030 -0.0023 9.3154 76.5773 90.6911 169.1648
frequency: 76.4199 90.6370 169.1611 232.0077 288.2998 355.9059 396.3572 532.1283 572.7950 649.3913 691.7729 911.0050 922.8253 958.1600 984.7711 1097.6887 1111.1692 1162.4959 1181.5605 1228.4184 1341.0547 1407.2646 1434.2151 1450.6788 1464.7467 1467.1478 1492.9518 1672.4021 2839.0453 2873.2734 3006.7968 3014.2700 3081.9605 3112.6092 3226.2025 3455.8432
redmass: 3.1461 1.9309 3.9246 1.1798 3.2812 2.4938 3.1762 5.7345 3.9267 1.3334 1.0532 1.7418 1.3353 1.8409 1.7654 1.9410 1.3610 3.8700 2.0133 1.2505 1.3109 1.1636 1.1431 1.1284 1.1279 1.0619 1.0476 6.4420 1.0706 1.0560 1.0859 1.0767 1.0986 1.0637 1.1146 1.0746
irintensity: 3.2068 3.5689 1.6364 1.7396 1.9877 0.7622 2.9912 13.6327 39.5955 102.2705 29.1451 3.5294 86.9795 1.7753 6.3650 57.5649 0.4668 19.0242 43.9385 12.6889 4.0949 5.4458 0.6792 39.9778 3.1779 12.5481 18.3093 49.9971 87.0770 153.2487 27.9703 46.5428 32.9265 0.8460 4.2253 2.4001
temp: 298.150 k
press: 1.00000 atm
elementType: 17 7 6 6 6 6 1 1 1 1 1 1 1 1
symmnumber: 1
zpe: 298787.9 jmol-1
zpe.correction: 0.113802 hartree
zpe.thermalcorrener: 0.121355 hartree
zpe.thermalcorrenthalpy: 0.122299 hartree
zpe.thermalcorrgfe: 0.081458 hartree
zpe.sumelectzpe: -671.502536 hartree
zpe.sumelectthermal: -671.494983 hartree
zpe.sumelectthermalent: -671.494039 hartree
zpe.sumelectthermalfe: -671.534880 hartree
dipole: -1.0541 1.0129 0.9788
dipole: 1.7594
quadrupole: -41.6742 -40.8346 -47.2466
quadrupole: 3.2600 -2.2007 1.1573
quadrupole: 1.5776 2.4172 -3.9948 3.2600 -2.2007 1.1573
hfenergy: -671.6163382 hartree
pointgroup: C01[X(C4H8Cl1N1)]
dipole: -0.3482549 -0.4375417 -0.4079148 debye
dipolederiv: -0.2683872 -0.1569665 -0.0368365 -0.1050383 -0.737427 -0.0275553 -0.0489544 -0.0297353 -0.1102464 -0.7009377 0.0679534 -0.0475502 -0.0044786 -0.2029718 0.0614924 -0.0286291 0.0230765 -0.6654213 0.2543872 -0.0998719 -0.1710948 -0.2440071 0.0774985 0.0071664 -0.2369373 -0.0248082 0.5210831 0.4918882 -0.0029104 0.145791 0.136088 0.1879392 -0.086635 0.1835358 -0.084979 0.3422151 0.3922543 0.1418567 0.1694025 0.1741894 1.1396611 0.0071665 0.1975431 0.0018144 -0.0657583 -0.2572352 0.1384442 0.0357778 0.1147736 -0.3193893 0.0282411 0.0426923 0.0133455 -0.3520678 -0.0526624 0.0498625 -0.0375232 0.0327273 0.0302469 0.1221234 0.0905571 0.0386644 -0.2513326 0.0072379 -0.0661203 -0.0025538 0.0059216 -0.145654 -0.0488114 0.0249962 -0.012855 0.0663231 0.1542416 -0.0438501 0.0135662 -0.0201717 0.0243149 -0.0857518 0.0320188 0.0351592 0.3050047 -0.0732472 0.0082362 -0.0350748 0.0309538 0.0154803 0.1229823 -0.2050015 0.1326426 -0.2355583 -0.0684152 0.0605326 0.0765019 0.1093482 0.0607598 -0.0724197 0.1086565 -0.0838979 -0.0153959 0.0395015 -0.0199653 -0.0171855 -0.126168 -0.1665298 -0.0109874 -0.058694 -0.0020445 0.0804814 -0.0166914 -0.0384061 -0.0647345 -0.0418613 0.0954643 -0.0083004 -0.06935 -0.0013993 0.1984766 0.0980656 -0.0387952 -0.0284861 -0.0622769 -0.0593932 -0.0087113 -0.0324334 -0.0049834 0.1821966 unknown
polarizability: 69.9570617|-4.6860122|68.8480383|4.3579056|0.1569553|39.0700459 unknown
InChI: InChI=1S/C4H8ClN/c1-4(5)3-6-2/h6H,1,3H2,2H3
charge 0 multiplicity 1
14 atoms
Cl 1.472906 1.57941 0.019677
N  -1.383877 0.148871 0.407135
C  -0.401193 -0.433792 -0.52969
C  -2.77935 0.032708 -0.054083
C  1.022528 -0.218186 -0.08234
C  1.965583 -1.135386 0.208692
H  -0.50833 -0.03024 -1.570754
H  -0.572343 -1.526614 -0.590076
H  -1.12801 1.113132 0.658512
H  -2.969803 0.477976 -1.062104
H  -3.447603 0.52547 0.673014
H  -3.069332 -1.033718 -0.101612
H  2.984344 -0.863645 0.495849
H  1.711081 -2.200185 0.168379
