program: Gaussian 09
title: 000013580
version: EM64L-G09RevD.01
frameworkgroup: C1[X(C7H15NO2)]
method: RPBEPBE
basis: SDD
operation: Freq
keyword: #p
keyword: freq=noraman
keyword: PBEPBE/SDD
title: #p freq=noraman PBEPBE/SDD
converged: YES YES NO NO
title: Mulliken charges:
elementType: O O N C C C C C C C H H H H H H H H H H H H H H H
charge: -0.418186 -0.231194 -0.571067 -0.361936 -0.370545 -0.373631 -0.356555 -0.487266 -0.393259 0.171931 0.188542 0.192915 0.192271 0.190642 0.217113 0.216861 0.180142 0.217958 0.251678 0.252852 0.207005 0.178204 0.258222 0.272376 0.374928
chargesum: 0.00000
title: Mulliken charges with hydrogens summed into heavy atoms:
elementType: O O N C C C C C C C
charge: -0.043258 -0.231194 -0.040469 0.019520 0.012368 0.060343 0.041545 0.017264 -0.008051 0.171931
polarizability: 1.17148908e+02 -2.99356381e-01 8.40397718e+01 -6.15145491e-01 1.02861419e+00 6.68236345e+01
1716.lowfreq: -0.0011 -0.0011 -0.0006 4.3462 7.4486 13.6196 37.5839 46.5957 58.9085
frequency: 34.5766 39.3447 58.9057 82.4165 92.2124 139.2033 146.1651 149.2804 223.2092 235.7126 285.6293 415.5286 427.3748 500.4163 507.5183 587.6554 605.6644 635.2481 726.1007 746.7658 793.4204 856.7066 871.4917 945.6951 977.4710 1005.7781 1028.7069 1055.6877 1078.1035 1081.2885 1101.7647 1114.2168 1123.8762 1197.0853 1217.4372 1236.2453 1255.0703 1270.5655 1281.7679 1291.3423 1296.1546 1299.7987 1335.8024 1359.8734 1373.0949 1389.6568 1438.1213 1463.8394 1465.5018 1473.5136 1485.3337 1494.0938 1637.5063 1669.9069 2860.7907 2952.9026 2955.2571 2963.5327 2986.8589 2991.5006 2995.9483 3007.1121 3015.0795 3031.4361 3045.3929 3062.3521 3450.7690 3512.4518 3578.3682
redmass: 3.0826 3.7968 4.7293 1.7250 2.7441 1.9202 2.9447 2.8584 3.6709 1.3756 3.0238 3.4016 4.0215 1.7682 3.0700 4.5702 1.2936 1.3294 1.0881 1.1336 1.2318 4.8828 1.3107 1.8560 1.5001 4.5339 2.3524 2.7408 2.0827 2.1982 2.9579 1.7919 1.6502 1.4953 1.3369 1.4162 1.4206 1.2629 1.0517 1.1677 1.1333 1.2963 1.5010 1.6361 1.8442 1.4679 1.0847 1.0786 1.0634 1.0907 1.0965 1.0912 1.0942 8.2371 1.0717 1.0591 1.0626 1.0618 1.0613 1.0972 1.0597 1.0861 1.1000 1.0992 1.1020 1.1031 1.0448 1.0639 1.0974
irintensity: 1.7223 0.4141 0.8526 3.3192 0.4724 0.9572 1.3156 0.4427 9.9371 36.5361 15.6187 0.8358 38.4587 32.2464 12.4996 20.8790 216.8140 129.4727 18.2222 0.3636 4.4950 1.3013 2.0216 1.5573 4.4905 120.5917 76.4992 52.8592 21.8219 12.1655 4.5831 15.2415 21.1708 9.0263 7.7499 1.6366 6.8848 8.1723 3.8981 2.8850 5.3799 5.6677 19.9438 4.5354 34.0658 14.0234 27.8982 1.1388 0.3033 0.2967 14.9676 7.7984 39.8462 210.0990 114.5289 2.2341 2.7665 85.9638 4.7488 0.8998 40.2814 40.8869 3.8850 0.2945 77.7720 96.9944 1.9731 17.4716 0.1314
temp: 298.150 k
press: 1.00000 atm
elementType: 8 8 7 6 6 6 6 6 6 6 1 1 1 1 1 1 1 1 1 1 1 1 1 1 1
symmnumber: 1
zpe: 568313.5 jmol-1
zpe.correction: 0.216459 hartree
zpe.thermalcorrener: 0.229169 hartree
zpe.thermalcorrenthalpy: 0.230113 hartree
zpe.thermalcorrgfe: 0.175665 hartree
zpe.sumelectzpe: -480.113852 hartree
zpe.sumelectthermal: -480.101143 hartree
zpe.sumelectthermalent: -480.100198 hartree
zpe.sumelectthermalfe: -480.154646 hartree
dipole: -0.7842 -0.7664 -0.9880
dipole: 1.4760
quadrupole: -54.2930 -68.3901 -61.1205
quadrupole: -8.1475 5.9184 2.1481
quadrupole: 6.9749 -7.1222 0.1473 -8.1475 5.9184 2.1481
hfenergy: -480.3303111 hartree
pointgroup: C01 [X(C7H15N1O2)]
dipole: -0.3063348 0.271124 0.4121371 debye
dipolederiv: -1.0549072 -0.5442663 -0.0170451 -0.477637 -0.6112643 -0.0023025 -0.0134771 -0.0019543 -0.4336757 -0.6860722 0.1532548 0.0102914 -0.1046343 -0.9699725 -0.0279227 -0.0003316 -0.0305923 -0.3054538 -0.660166 0.1544617 -0.0065232 0.1817393 -0.5042122 0.2478918 -0.044845 0.2495198 -0.4503826 -0.0276186 -0.0129786 0.0030085 -0.0025139 0.0963229 -0.003844 0.0008441 -0.0046237 0.1924668 -0.0505079 -0.0050379 0.0047851 0.0024007 0.0889522 -0.0101002 -0.0008758 -0.0115572 0.18382 0.0198304 0.0042459 0.0020656 -0.0180359 0.0546948 -0.0059925 -0.0010405 -0.0061418 0.1567664 -0.0970158 -0.0164908 0.0169132 -0.0997363 0.0576277 0.0155891 -0.013541 0.0391187 0.1745282 -0.2713495 0.0961147 0.0095488 0.2878416 -0.0984779 -0.0153002 0.0216815 -0.0140784 0.1541734 0.5176176 -0.2111381 0.0341831 -0.1091773 0.3335762 -0.1134153 -0.038356 -0.0808742 0.3278843 1.5111262 0.1827355 -0.0071929 0.2528562 1.3767631 0.0493566 -0.0063272 0.0506194 0.1860258 0.0357604 0.0007983 0.0023131 0.0008344 -0.0296347 -0.1125898 -0.0001594 -0.1347463 -0.1073577 0.0365077 0.0033929 -0.0036359 0.0006816 -0.0567109 0.1159548 -0.0000057 0.1377731 -0.0743906 0.0396006 0.006327 0.0070237 0.0054513 -0.0275911 -0.1117183 0.0093402 -0.1348358 -0.1011702 0.0415951 0.0053611 -0.0076343 0.0081032 -0.0586961 0.1169524 -0.0106996 0.1409145 -0.0755088 0.0531313 -0.0064104 -0.0037123 -0.0094185 -0.0002528 -0.0982137 0.0131311 -0.10663 -0.0789683 0.0538232 -0.0048339 0.0008536 -0.0067506 -0.0246329 0.1045402 -0.0153819 0.1131583 -0.0541623 0.0361437 0.006029 -0.0034727 0.009273 -0.0304088 -0.1176034 0.0237259 -0.1427646 -0.1200756 0.0574449 -0.0036541 0.0055306 0.00025 -0.0493415 0.114562 0.0032004 0.1230535 -0.0554131 0.0642113 0.0095637 -0.0011657 -0.0385345 0.0451715 -0.0816718 -0.0196891 -0.10462 -0.0275201 0.0645674 0.0101365 0.0013225 -0.0402109 0.0238626 0.0878269 0.0129162 0.1098925 -0.0048923 0.0326951 0.0230767 -0.0001532 0.0242792 -0.0252953 -0.1010491 -0.009377 -0.134533 -0.1138017 -0.0718913 0.085268 -0.03895 0.0752384 -0.1636463 0.1487851 -0.0527228 0.2019941 -0.1169706 0.1676922 0.0223759 -0.0213976 0.0371699 0.247062 -0.1016208 0.0275503 -0.1798631 0.0512083 -0.011949 -0.0611288 0.0066896 -0.1360516 0.1415994 -0.0875158 0.1055262 -0.0683292 0.3034745 0.1997305 0.1027973 0.0063541 0.1565818 0.1845048 -0.0105987 0.0089137 -0.0098999 0.3893957 unknown
polarizability: 117.1499483|0.5526555|83.8189888|0.0764455|2.216974|67.0433776 unknown
InChI: InChI=1S/C7H15NO2/c8-6-4-2-1-3-5-7(9)10/h9H,1-6,8H2
charge 0 multiplicity 1
25 atoms
O  4.559817 0.820106 -0.006136
O  3.657116 -1.316661 -0.088654
N  -5.452586 0.238884 0.054174
C  -0.39773 0.505733 0.025812
C  -1.63757 -0.415545 -0.016988
C  0.933175 -0.275686 -0.030006
C  -2.970669 0.362892 0.035773
C  2.15671 0.65902 0.014766
C  -4.208366 -0.556496 -0.000356
C  3.478984 -0.080618 -0.033257
H  -0.430606 1.118185 0.951601
H  -0.445899 1.220777 -0.822022
H  -1.605855 -1.027865 -0.942304
H  -1.590692 -1.130941 0.8307
H  0.971565 -0.887878 -0.951494
H  0.985794 -0.99092 0.813194
H  -2.999413 0.97673 0.961956
H  -3.038819 1.070058 -0.813462
H  2.150446 1.279067 0.933197
H  2.140209 1.378666 -0.827299
H  -4.206679 -1.122445 -0.952371
H  -4.115102 -1.311338 0.820801
H  -5.53588 0.813065 0.89981
H  -6.307844 -0.29534 -0.127678
H  5.411795 0.305351 -0.037654
