program: Gaussian 09
title: 000151679
version: EM64L-G09RevD.01
frameworkgroup: C1[X(C15H8BrN3O4)]
method: RPBEPBE
basis: SDD
operation: Freq
keyword: #p
keyword: freq=noraman
keyword: PBEPBE/SDD
title: #p freq=noraman PBEPBE/SDD
converged: YES YES NO NO
title: Mulliken charges:
elementType: Br O O O O N N N C C C C C C C C C C C C C C C H H H H H H H H
charge: 0.068977 -0.206255 -0.148820 -0.191900 -0.182979 0.020524 -0.652890 -0.011633 0.486771 -0.331555 0.126932 0.247118 -0.291374 -0.290255 -0.125840 0.151414 0.623988 0.228021 -0.709096 -0.332344 -0.349905 -0.232263 -0.212913 0.293668 0.261213 0.295688 0.277337 0.245883 0.247176 0.358170 0.337142
chargesum: 0.00000
title: Mulliken charges with hydrogens summed into heavy atoms:
elementType: Br O O O O N N N C C C C C C C C C C C C C C C
charge: 0.068977 -0.206255 -0.148820 -0.191900 -0.182979 0.020524 0.042421 -0.011633 0.486771 -0.331555 0.126932 0.247118 0.002294 -0.029042 -0.125840 0.151414 0.623988 0.228021 -0.709096 -0.036656 -0.072567 0.013621 0.034263
polarizability: 3.83737078e+02 -2.53340799e+01 2.64720115e+02 -8.91777632e+00 -1.22572906e+00 9.58744507e+01
1716.lowfreq: -2.9393 0.0006 0.0007 0.0008 3.9913 5.4522 22.0916 33.3807 48.7506
frequency: 22.0769 33.3784 48.7487 58.4277 77.7899 96.5403 114.6414 139.0792 150.3489 168.0357 188.6462 224.9084 227.7835 237.2954 275.6760 306.1977 340.7411 352.4647 378.1529 390.1120 412.0425 433.5806 436.3018 482.0159 494.2529 514.6176 550.3914 575.1574 578.5702 612.9503 629.2832 648.5723 653.2053 672.1628 677.2094 719.2398 730.1642 759.4583 761.7297 768.0412 785.9828 791.2046 861.9485 875.1196 896.6737 908.7631 975.1218 984.3514 1002.8728 1003.8668 1029.7764 1041.8100 1071.0097 1090.9823 1100.4553 1134.9061 1167.4977 1177.9205 1218.5443 1241.7442 1255.2201 1274.0556 1298.3696 1332.7906 1354.0468 1365.1263 1376.2060 1388.5514 1428.7906 1432.7429 1475.0459 1530.8829 1546.5186 1553.9350 1570.9694 1577.4667 1585.7144 1604.8133 1634.9029 3147.8685 3160.2598 3162.4813 3174.1743 3179.7166 3184.4192 3491.2683 3648.5747
redmass: 10.6869 7.9373 10.5753 10.4902 8.0669 8.1795 6.1354 9.9227 6.3981 8.5574 8.4848 12.4465 7.2557 8.4814 7.4139 6.2120 5.3219 5.2735 9.1570 6.4738 4.2532 8.1868 4.8100 3.5118 8.4131 3.5988 4.9903 2.8078 3.3286 3.1788 7.0897 1.1610 7.1365 6.1940 6.8668 5.9307 4.2730 5.0456 7.8410 7.1146 1.5803 5.4559 1.8951 6.1511 1.5109 3.2468 1.4084 6.3288 1.3710 1.3857 3.6277 4.0831 3.1400 2.3823 2.0394 1.8839 1.6688 1.0725 11.5221 3.5036 1.7623 2.6399 3.2687 5.4227 5.5875 11.4937 4.7486 6.8351 3.0220 2.8277 2.9520 4.6707 10.0106 4.2656 6.2755 4.0727 2.6498 6.9295 4.0622 1.0869 1.0894 1.0911 1.0954 1.0980 1.0994 1.0457 1.1034
irintensity: 1.6264 4.9036 1.0816 2.1850 0.2090 1.5937 2.2648 1.1396 5.4180 0.1502 0.4701 7.2084 1.8746 0.6292 1.4731 0.6260 2.2219 8.4467 15.5311 8.7933 2.3250 0.9268 2.4224 19.1710 3.9724 1.2419 9.0568 38.6409 24.3555 36.2395 7.2584 167.5769 11.1534 9.5541 10.0249 14.9014 27.4286 13.4082 32.4541 13.5889 53.7498 15.1159 11.0358 19.9970 4.1773 14.1548 1.3959 22.6285 1.8848 5.0182 46.4121 21.7504 20.7624 41.0269 54.6728 1.3474 4.3175 0.9437 182.1738 8.5894 29.9232 77.8570 52.1208 25.3583 21.8439 209.8329 233.6919 21.3464 39.7586 14.3572 1.1299 102.3165 355.9073 279.5557 33.3001 76.9360 18.8815 2.5243 405.4694 2.7656 1.1445 6.3225 4.7962 6.7532 10.6434 136.6680 60.9213
temp: 298.150 k
press: 1.00000 atm
elementType: 35 8 8 8 8 7 7 7 6 6 6 6 6 6 6 6 6 6 6 6 6 6 6 1 1 1 1 1 1 1 1
symmnumber: 1
zpe: 538531.6 jmol-1
zpe.correction: 0.205116 hartree
zpe.thermalcorrener: 0.224140 hartree
zpe.thermalcorrenthalpy: 0.225084 hartree
zpe.thermalcorrgfe: 0.155448 hartree
zpe.sumelectzpe: -1053.345542 hartree
zpe.sumelectthermal: -1053.326518 hartree
zpe.sumelectthermalent: -1053.325574 hartree
zpe.sumelectthermalfe: -1053.395210 hartree
dipole: -0.3319 0.1565 -2.9149
dipole: 2.9379
quadrupole: -111.1319 -144.8856 -143.5946
quadrupole: -30.4886 -7.0834 0.2665
quadrupole: 22.0721 -11.6815 -10.3906 -30.4886 -7.0834 0.2665
hfenergy: -1053.5506583 hartree
pointgroup: C01 [X(C15H8Br1N3O4)]
dipole: -0.1290423 0.5832574 -0.9895416 debye
polarizability: 388.9327829|6.0072603|223.7990314|-2.7097487|67.8542312|131.59983 unknown
InChI: InChI=1S/C15H8BrN3O4/c16-11-12(17)14(20)8-5-6-9(18-13(8)15(11)21)7-3-1-2-4-10(7)19(22)23/h1-6H,17H2
charge 0 multiplicity 1
31 atoms
Br -4.984793 -2.487339 -1.084604
O  -3.644024 2.393555 0.450881
O  -1.867913 -2.552388 -1.206593
O  4.228258 2.117371 1.837812
O  2.326965 0.977843 2.380868
N  0.026255 -0.635055 -0.503982
N  -5.475719 0.507462 -0.08513
N  3.327861 1.22004 1.602698
C  -1.749967 0.962449 -0.012825
C  -1.289881 -0.323231 -0.41899
C  0.95843 0.321111 -0.189615
C  2.378645 -0.111566 -0.351887
C  -0.784932 1.960853 0.268507
C  0.5790 1.645301 0.170068
C  -3.192051 1.258411 0.096925
C  -2.277504 -1.427902 -0.79454
C  -4.165313 0.154213 -0.229973
C  3.492823 0.382798 0.384501
C  -3.69865 -1.089005 -0.647831
C  2.660413 -1.045627 -1.384661
C  4.822634 0.029099 0.069244
C  3.980637 -1.432425 -1.692701
C  5.069378 -0.879993 -0.978512
H  -1.122969 2.961068 0.554952
H  1.332899 2.41396 0.355401
H  1.808293 -1.457155 -1.933304
H  5.637121 0.450911 0.664376
H  4.15908 -2.157837 -2.492823
H  6.097548 -1.166907 -1.219866
H  -5.677287 1.461521 0.223177
H  -6.224637 -0.154935 -0.280273
