program: Gaussian 09
title: 000151672
version: EM64L-G09RevD.01
frameworkgroup: C1[X(C15H11N3O2)]
method: RPBEPBE
basis: SDD
operation: Freq
keyword: #p
keyword: freq=noraman
keyword: PBEPBE/SDD
title: #p freq=noraman PBEPBE/SDD
converged: NO YES NO NO
title: Mulliken charges:
elementType: O O N N N C C C C C C C C C C C C C C C H H H H H H H H H H H
charge: -0.230021 -0.224544 -0.148040 -0.654056 -0.666473 0.424710 -0.257981 0.166728 0.249945 -0.296433 -0.295276 -0.156361 0.091823 0.428740 0.285686 -0.531443 -0.345539 -0.406117 -0.297173 -0.207418 0.283156 0.229411 0.252849 0.209753 0.218021 0.228176 0.226918 0.323165 0.356197 0.293087 0.448512
chargesum: 0.00000
title: Mulliken charges with hydrogens summed into heavy atoms:
elementType: O O N N N C C C C C C C C C C C C C C C
charge: -0.230021 -0.224544 -0.148040 0.025306 0.075126 0.424710 -0.257981 0.166728 0.249945 -0.013277 -0.065865 -0.156361 0.091823 0.428740 0.285686 -0.278595 -0.135786 -0.188096 -0.068997 0.019500
polarizability: 4.61330570e+02 -3.00285954e+01 2.17215834e+02 -2.89585910e-02 -6.10934648e-02 7.22938598e+01
1716.lowfreq: -5.0532 -0.0005 -0.0001 0.0003 6.0383 6.7402 39.8587 44.8921 86.6124
frequency: 39.8581 44.8807 86.6108 101.2903 108.3033 157.6901 187.1719 218.3901 233.5670 252.3914 276.8930 325.5916 377.6644 383.2210 403.2411 424.4609 435.4309 461.8457 474.5243 479.5876 513.7987 521.3751 525.3866 539.7422 556.3396 570.4882 639.2460 646.3135 660.4313 679.7646 713.3518 735.7316 744.0293 754.9099 762.6369 811.3025 818.8744 847.9367 854.8980 857.0879 882.2736 939.2153 968.8312 974.7370 976.9978 998.6306 1013.4121 1036.2954 1046.5823 1062.1077 1095.2345 1146.3762 1159.6408 1178.3782 1248.0805 1271.7974 1278.9932 1300.8832 1316.8773 1332.3937 1347.4697 1387.2372 1399.8718 1414.5464 1433.6446 1474.1883 1483.7824 1521.2120 1531.9273 1537.8081 1544.8652 1566.0395 1593.5508 1601.0898 1627.2050 1644.2606 3101.0437 3120.4189 3139.1018 3144.6085 3148.7759 3155.5573 3170.3701 3183.8720 3488.3854 3606.4931 3667.8065
redmass: 5.4121 5.0385 7.9583 6.4847 4.7483 6.6490 5.1655 5.3622 7.4257 5.7432 4.7242 3.6605 4.8468 6.6128 3.2276 10.0480 3.1556 2.4359 5.4035 5.2330 2.9715 7.2119 1.2532 1.5329 6.9216 3.3706 6.6461 4.4968 1.1459 6.0590 2.9366 8.4304 2.2971 5.9088 1.5935 5.2230 2.3372 1.7423 5.3737 1.6871 3.0382 1.3810 6.6299 1.3334 1.0903 1.3587 3.8643 2.2337 1.8063 1.7586 2.5448 1.6953 1.2951 1.0704 1.7622 1.8607 2.4786 3.0072 3.8411 4.8202 1.9938 5.1881 3.2907 5.9848 4.3742 2.4219 3.6478 3.4998 2.6851 6.2584 3.9525 3.3002 2.3325 3.0899 6.1140 3.8342 1.0700 1.0863 1.0880 1.0917 1.0936 1.0899 1.1000 1.0944 1.0488 1.0850 1.0998
irintensity: 1.9148 1.2457 5.6683 1.1448 4.6070 0.1600 0.3274 1.2217 0.4011 2.9163 4.2295 7.1922 11.8555 33.8609 15.2461 3.3794 28.3957 13.2912 6.8431 1.6902 14.2986 3.8897 27.0587 127.5437 10.2110 0.1066 15.5305 8.2111 170.1336 1.1668 17.3792 0.3750 7.2422 8.4430 120.5988 7.7730 18.1264 8.9850 0.0822 0.9988 43.3125 2.9555 8.9898 0.0371 95.5861 1.8989 7.1272 3.8510 1.7089 9.3478 46.5070 7.1731 5.6834 29.6844 39.4305 29.9123 198.5539 88.6737 271.7678 24.2108 22.9130 62.3853 8.2294 13.5778 56.1265 239.2921 27.4287 260.7247 240.0901 208.9630 365.3559 458.2497 84.9753 81.3224 84.3859 266.8279 102.9785 7.8588 9.5370 10.6659 27.6839 2.5758 31.3381 19.0839 116.1275 62.7927 70.8978
temp: 298.150 k
press: 1.00000 atm
elementType: 8 8 7 7 7 6 6 6 6 6 6 6 6 6 6 6 6 6 6 6 1 1 1 1 1 1 1 1 1 1 1
symmnumber: 1
zpe: 607039.8 jmol-1
zpe.correction: 0.231209 hartree
zpe.thermalcorrener: 0.246962 hartree
zpe.thermalcorrenthalpy: 0.247906 hartree
zpe.thermalcorrgfe: 0.188045 hartree
zpe.sumelectzpe: -891.559714 hartree
zpe.sumelectthermal: -891.543962 hartree
zpe.sumelectthermalent: -891.543018 hartree
zpe.sumelectthermalfe: -891.602879 hartree
dipole: 0.9506 -0.7994 0.0047
dipole: 1.2420
quadrupole: -77.4417 -114.3480 -120.8090
quadrupole: 5.2362 0.0788 -0.0162
quadrupole: 26.7578 -10.1484 -16.6094 5.2362 0.0788 -0.0162
hfenergy: -891.7909235 hartree
pointgroup: C01 [X(C15H11N3O2)]
dipole: 0.3757243 -0.2308304 -0.2105271 debye
polarizability: 461.6512234|-22.1919851|149.7551508|-18.2223411|72.1079587|139.4338904 unknown
InChI: InChI=1S/C15H11N3O2/c16-10-4-2-1-3-8(10)12-6-5-9-14(18-12)13(19)7-11(17)15(9)20/h1-7H,16-17H2
charge 0 multiplicity 1
31 atoms
O  3.915679 -1.571768 -1.310026
O  1.333339 1.994429 2.005779
N  -0.199205 0.313702 0.426293
N  5.398177 0.042758 0.219494
N  -2.260699 1.47078 1.487769
C  1.805733 -0.696863 -0.508524
C  1.145395 0.224921 0.350686
C  -1.01321 -0.503352 -0.340167
C  -2.463848 -0.338044 -0.191853
C  0.989547 -1.54724 -1.30987
C  -0.401925 -1.454982 -1.230053
C  3.269753 -0.763604 -0.559597
C  1.940007 1.169046 1.242896
C  4.041053 0.18285 0.337768
C  -3.041073 0.646938 0.716898
C  3.388719 1.081162 1.175337
C  -3.36587 -1.151322 -0.949871
C  -4.472341 0.74942 0.80242
C  -4.756102 -1.034109 -0.849581
C  -5.309587 -0.067659 0.040562
H  1.476412 -2.263429 -1.979152
H  -1.017207 -2.110311 -1.849627
H  3.948326 1.765693 1.822793
H  -2.960885 -1.898897 -1.638458
H  -4.898811 1.49229 1.487541
H  -5.411139 -1.675712 -1.446868
H  -6.397037 0.036211 0.128718
H  6.051211 0.607285 0.756345
H  5.737667 -0.662422 -0.440319
H  -2.693973 2.14688 2.114072
H  -1.225303 1.361449 1.392693
