program: Gaussian 09
title: 000151638
version: EM64L-G09RevD.01
frameworkgroup: C1[X(C7H16N2O3)]
method: RPBEPBE
basis: SDD
operation: Freq
keyword: #p
keyword: freq=noraman
keyword: PBEPBE/SDD
title: #p freq=noraman PBEPBE/SDD
converged: YES YES NO NO
title: Mulliken charges:
elementType: O O O N N C C C C C C C H H H H H H H H H H H H H H H H
charge: -0.453873 -0.216965 -0.460625 -0.299114 -0.571262 -0.404434 -0.369674 -0.162985 -0.353628 -0.397417 0.179604 -0.356778 0.222629 0.215067 0.181322 0.217156 0.241876 0.224653 0.181169 0.286642 0.176917 0.210146 0.230912 0.201627 0.258784 0.273743 0.382166 0.362343
chargesum: 0.00000
title: Mulliken charges with hydrogens summed into heavy atoms:
elementType: O O O N N C C C C C C C
charge: -0.071707 -0.216965 -0.098283 -0.012472 -0.038735 0.033262 0.028804 0.078891 0.052194 -0.010354 0.179604 0.075761
polarizability: 1.24448614e+02 -3.90663652e+00 9.90424498e+01 -5.85557795e+00 -1.24326953e+00 8.17608483e+01
1716.lowfreq: -5.8397 -0.0006 -0.0003 0.0002 7.5847 9.6867 34.7241 46.8722 51.2726
frequency: 34.3956 46.8468 51.1767 65.7545 90.1150 123.8768 138.3854 149.5181 175.7184 214.1956 237.6844 250.3202 286.6841 347.0702 364.8976 460.0223 485.3006 506.1127 516.2462 591.4580 599.4553 603.1110 632.9802 701.5520 741.9820 768.7610 824.2363 889.8574 921.9812 925.2097 966.2060 1004.9482 1024.8545 1047.6511 1068.6308 1084.9384 1103.0571 1120.8133 1132.7324 1157.0185 1202.1436 1227.7670 1234.4254 1247.3272 1277.9706 1288.5122 1295.5293 1309.9107 1334.6305 1339.8291 1343.5682 1363.0209 1389.5037 1399.6366 1444.3423 1455.3264 1461.6935 1465.0912 1478.3045 1492.5155 1639.2963 1664.8719 2858.5824 2958.7032 2961.9587 2975.5796 2990.6278 3009.7558 3013.3817 3018.1523 3045.2990 3063.1523 3094.8581 3455.3865 3495.3281 3498.2437 3501.0084 3583.3040
redmass: 5.1730 6.8680 1.9338 4.3635 3.6755 2.8456 1.8640 6.0658 3.6226 3.6867 1.2924 2.7940 4.3103 2.6059 3.3611 3.6848 2.4808 2.4479 1.1060 1.4010 1.6275 2.7362 1.7644 2.4272 1.3012 1.6168 1.5960 7.1775 1.9122 1.5598 2.3033 3.1054 2.7284 1.7767 2.4740 1.8600 2.7332 2.2563 2.0266 2.7789 1.2726 1.3424 1.5180 1.3097 1.4112 1.0646 1.1433 1.2788 1.2657 1.3676 1.3657 1.5722 1.4600 1.1177 1.0916 1.0860 1.2362 1.0693 1.0932 1.0903 1.0944 8.2257 1.0715 1.0611 1.0650 1.0668 1.0608 1.0856 1.0932 1.0856 1.1010 1.1031 1.0987 1.0448 1.0753 1.0659 1.0637 1.0976
irintensity: 1.0265 0.5814 3.1764 1.8874 0.3257 1.8409 1.1998 0.7101 0.6003 2.0737 53.1436 3.2472 3.6314 10.2826 8.3022 25.4290 27.1700 2.1107 271.4154 242.0724 103.7238 30.9527 84.9214 39.0773 21.9583 1.9616 4.3866 130.4085 17.6175 11.2624 4.6852 230.7373 31.3360 18.8398 12.0541 23.5431 14.9074 42.1567 50.5351 72.4390 7.1632 4.9679 8.4439 1.7619 24.2567 3.5749 0.8682 2.7989 4.1061 6.3628 4.9214 0.1035 14.0936 34.3176 4.1616 7.7862 37.2283 1.0792 8.3301 5.9534 40.1387 204.3688 117.1098 7.3653 45.1725 65.2558 24.1714 33.7533 4.3631 15.7035 29.6181 75.7300 32.7834 1.5471 4.5700 47.9427 9.6094 0.2067
temp: 298.150 k
press: 1.00000 atm
elementType: 8 8 8 7 7 6 6 6 6 6 6 6 1 1 1 1 1 1 1 1 1 1 1 1 1 1 1 1
symmnumber: 1
zpe: 624057.7 jmol-1
zpe.correction: 0.237691 hartree
zpe.thermalcorrener: 0.252451 hartree
zpe.thermalcorrenthalpy: 0.253395 hartree
zpe.thermalcorrgfe: 0.194591 hartree
zpe.sumelectzpe: -610.506908 hartree
zpe.sumelectthermal: -610.492148 hartree
zpe.sumelectthermalent: -610.491204 hartree
zpe.sumelectthermalfe: -610.550008 hartree
dipole: -1.9358 -0.1204 -2.5574
dipole: 3.2097
quadrupole: -81.6635 -68.2852 -75.8365
quadrupole: 4.9553 6.0744 -3.6393
quadrupole: -6.4017 6.9765 -0.5748 4.9553 6.0744 -3.6393
hfenergy: -610.7445992 hartree
pointgroup: C01 [X(C7H16N2O3)]
dipole: -0.7860481 -0.1763023 0.972488 debye
polarizability: 124.4009025|0.869099|98.3378984|7.44692|2.9263562|82.5131112 unknown
InChI: InChI=1S/C7H16N2O3/c8-4-2-1-3-6(7(11)12)9-5-10/h6,9-11H,1-5,8H2
charge 0 multiplicity 1
28 atoms
O  2.087126 -1.956214 0.389265
O  0.799587 -1.524629 -1.494724
O  4.271643 0.021245 0.394474
N  2.09104 1.15469 -0.042563
N  -5.4131 0.488009 0.0054
C  -0.378148 0.812708 -0.139828
C  -1.590999 -0.031909 0.31082
C  0.985564 0.229022 0.283383
C  -2.934394 0.633083 -0.063029
C  -4.158177 -0.19723 0.374746
C  1.223655 -1.14071 -0.385684
C  3.327924 1.112569 0.718901
H  -0.43903 1.828582 0.294116
H  -0.39957 0.921993 -1.242231
H  -1.549107 -0.185973 1.410139
H  -1.541308 -1.035156 -0.157095
H  1.001603 0.071691 1.37886
H  -2.994624 0.789141 -1.157104
H  -2.988979 1.639214 0.405412
H  2.196727 1.347977 -1.044574
H  -4.066368 -0.419212 1.468195
H  -4.135048 -1.172262 -0.149575
H  3.908389 2.024394 0.508069
H  3.059649 1.081749 1.795232
H  -5.528383 1.406451 0.446101
H  -6.256224 -0.086817 0.093983
H  2.250694 -2.810577 -0.096819
H  3.831057 -0.84183 0.619331
