program: Gaussian 09
title: 000151625
version: EM64L-G09RevD.01
frameworkgroup: C1[X(C21H23NO5)]
method: RPBEPBE
basis: SDD
operation: Freq
keyword: #p
keyword: freq=noraman
keyword: PBEPBE/SDD
title: #p freq=noraman PBEPBE/SDD
converged: YES YES NO NO
title: Mulliken charges:
elementType: O O O O O N C C C C C C C C C C C C C C C C C C C C C H H H H H H H H H H H H H H H H H H H H H H H
charge: -0.469657 -0.268790 -0.267462 -0.302548 -0.301465 -0.090249 -0.271759 -0.241690 0.312687 -0.411538 -0.611187 0.404364 -0.537291 0.304067 0.301678 -0.421908 -0.550792 -0.553328 -0.512185 -0.568729 0.170354 0.161217 0.179076 0.197235 -0.206401 -0.530868 -0.530112 0.310661 0.243783 0.212328 0.203448 0.229652 0.243410 0.233769 0.209061 0.233039 0.217524 0.299923 0.244865 0.255068 0.255194 0.354742 0.237538 0.227929 0.220340 0.254037 0.227833 0.222581 0.252574 0.227980
chargesum: 0.00000
title: Mulliken charges with hydrogens summed into heavy atoms:
elementType: O O O O O N C C C C C C C C C C C C C C C C C C C C C
charge: -0.114915 -0.268790 -0.267462 -0.302548 -0.301465 -0.090249 0.038903 0.002094 0.312687 0.004238 -0.138126 0.404364 -0.094461 0.304067 0.301678 0.028654 -0.250869 -0.308463 -0.257117 -0.313535 0.170354 0.161217 0.179076 0.197235 0.259066 0.171343 0.173023
polarizability: 3.63295617e+02 1.33922471e+01 2.20116816e+02 -6.25784623e+00 -8.64528445e-01 1.76800391e+02
1716.lowfreq: -8.6521 -3.4721 -0.0006 -0.0003 0.0006 4.5997 20.1110 42.1804 45.0088
frequency: 19.9400 42.1479 44.9972 60.3323 71.8380 84.0977 103.3892 106.1254 136.0933 138.8427 148.2241 152.9239 171.4560 177.5038 194.6364 198.6352 207.0979 225.4737 233.3646 248.1046 264.5472 274.1042 294.1657 323.2226 351.3086 358.8854 371.7250 397.6870 415.5107 421.8499 425.2215 462.7992 491.9716 494.4785 513.7975 532.5917 557.6345 598.3021 619.0021 648.8714 661.7627 675.5644 689.8123 701.9544 718.4456 722.7064 733.6672 739.3357 772.1070 781.5783 798.1685 830.9352 845.2665 869.0478 874.6270 881.1163 892.0095 912.1373 919.6820 929.6987 954.5760 956.1409 970.6446 974.3380 999.8180 1017.3728 1032.3411 1036.2681 1057.9931 1074.1980 1083.5622 1113.4341 1114.6185 1122.3015 1126.1800 1132.4354 1146.7249 1149.2674 1156.5130 1162.6725 1166.3173 1172.4552 1188.4227 1208.5183 1219.4334 1226.3009 1235.2938 1240.6728 1244.6965 1267.8237 1273.5638 1293.2135 1297.0725 1312.0410 1315.7522 1328.2352 1355.7952 1359.7377 1363.0855 1382.9732 1384.0798 1399.6382 1416.3959 1423.5127 1428.5410 1440.8538 1448.7023 1448.9381 1457.2484 1459.2396 1472.0544 1477.3778 1480.5541 1485.0565 1485.9039 1487.2088 1487.6279 1566.4003 1614.4352 1621.8801 1625.3346 2882.1675 2947.8557 2958.8090 2968.6493 2970.3706 2971.6266 2972.3979 2987.2902 3019.9460 3023.4113 3028.3335 3031.8467 3036.8924 3064.6951 3066.2534 3109.0503 3118.2864 3118.8789 3130.5406 3133.7837 3152.0323 3156.1637 3588.5875
redmass: 5.0938 4.8879 4.6994 3.7424 4.6080 5.2813 2.7207 2.4933 3.6148 3.5756 1.5182 2.2221 1.6624 2.5707 3.6786 2.9890 1.1277 4.4535 4.7506 3.3934 3.4171 4.4556 4.4424 3.2070 5.3203 3.1106 5.1046 4.5668 4.5034 3.7186 3.5305 3.7714 4.1236 3.8682 4.5731 5.4106 4.2540 4.8798 5.0713 6.8176 4.6616 8.8807 4.6397 5.9491 5.8538 4.4591 4.6198 3.3933 3.1136 5.4474 2.8349 4.8986 3.7628 1.4749 3.5244 1.5697 1.7421 4.3703 1.4164 2.2073 4.7879 3.2035 4.0906 4.2751 2.8729 3.7008 2.4612 2.3523 2.2495 1.5064 3.1994 1.2467 1.2449 2.3419 1.7887 1.3820 1.7534 1.4123 1.2694 1.5864 1.4762 2.3766 2.5801 1.2941 1.4521 1.3757 1.4207 1.3132 1.5041 2.9217 2.7960 1.3737 1.5084 1.4659 1.5951 1.5946 1.4527 1.2800 5.6627 2.1571 2.0005 1.3370 4.9156 1.1737 3.9904 1.2784 1.1517 1.1609 1.0540 1.0634 1.9921 1.0546 1.1047 1.7506 1.7889 1.1675 1.0674 8.8883 7.1328 7.8669 9.3536 1.0707 1.0772 1.0641 1.0309 1.0320 1.0592 1.0599 1.0629 1.1062 1.0975 1.0917 1.0910 1.0914 1.1038 1.1039 1.1077 1.1026 1.1026 1.0905 1.0913 1.0931 1.0928 1.0668
irintensity: 0.0807 0.1217 0.2303 4.4681 0.6100 4.1959 6.9704 12.4710 8.4172 1.9225 1.7848 3.2357 0.5398 1.8796 0.9556 2.5665 160.1135 0.1289 3.7372 3.8240 2.0342 9.6704 5.4875 4.5179 0.9512 0.6271 4.5883 9.8593 0.5294 3.2828 4.3847 1.6509 11.9844 0.4969 23.5280 0.6876 15.9761 3.3657 15.9641 8.2346 2.3365 0.3231 3.7350 2.5645 7.8392 4.2698 5.9791 5.1363 5.3404 14.0611 28.7015 33.0449 3.1017 16.2636 13.1474 1.9039 0.7951 42.6382 26.9848 30.8179 95.2943 36.4680 54.0152 109.1719 2.4035 8.0584 27.2174 42.0110 10.3260 9.1236 51.7807 17.3819 3.4257 16.9437 15.6125 8.4581 8.8969 13.5406 17.0502 54.9317 27.4632 2.0605 9.6706 9.4524 49.5684 55.3459 14.5621 9.0320 40.6436 116.3781 134.7079 5.8901 21.3044 22.2342 5.8318 15.7808 1.5584 1.0941 11.3799 28.6502 0.6591 1.4190 2.3847 0.5795 0.7589 10.3516 17.4249 8.7739 14.0263 11.3154 174.9447 5.7589 22.7454 146.7545 16.9300 55.6027 30.2871 2.2106 3.6253 1.1969 0.1174 75.9023 5.9390 38.7605 89.3791 75.4608 62.1064 32.9741 154.8547 64.9544 28.8313 3.0709 15.7305 50.3903 33.4968 22.0266 33.0655 26.9714 27.7528 14.2599 0.9639 1.3352 7.0184 6.2555
temp: 298.150 k
press: 1.00000 atm
elementType: 8 8 8 8 8 7 6 6 6 6 6 6 6 6 6 6 6 6 6 6 6 6 6 6 6 6 6 1 1 1 1 1 1 1 1 1 1 1 1 1 1 1 1 1 1 1 1 1 1 1
symmnumber: 1
zpe: 1052200.4 jmol-1
zpe.correction: 0.400762 hartree
zpe.thermalcorrener: 0.425374 hartree
zpe.thermalcorrenthalpy: 0.426319 hartree
zpe.thermalcorrgfe: 0.346564 hartree
zpe.sumelectzpe: -1242.836905 hartree
zpe.sumelectthermal: -1242.812292 hartree
zpe.sumelectthermalent: -1242.811348 hartree
zpe.sumelectthermalfe: -1242.891102 hartree
dipole: 1.3134 -1.1968 0.9797
dipole: 2.0291
quadrupole: -143.1772 -149.3781 -154.8867
quadrupole: 0.5618 1.1160 1.9022
quadrupole: 5.9702 -0.2308 -5.7394 0.5618 1.1160 1.9022
hfenergy: -1243.2376665 hartree
pointgroup: C01 [X(C21H23N1O5)]
dipole: 0.5176443 0.4945389 -0.3532272 debye
polarizability: 363.1231844|-15.0898583|220.2513175|3.3463756|2.5817485|176.838322 unknown
InChI: InChI=1S/C21H23NO5/c1-24-17-6-13-9-22-4-3-12-5-19-20(27-11-26-19)8-15(12)21(22)16(10-23)14(13)7-18(17)25-2/h5-8,16,21,23H,3-4,9-11H2,1-2H3
charge 0 multiplicity 1
50 atoms
O  -0.149365 2.183599 1.779523
O  -5.324672 1.864163 0.63825
O  -6.230027 0.251477 -0.887606
O  4.889644 1.673507 -1.180815
O  5.785793 -0.746985 0.223028
N  -0.29588 -1.773011 0.664289
C  -0.774297 -0.370815 0.744095
C  0.144562 0.62197 -0.085848
C  -2.231064 -0.284208 0.300189
C  -0.460206 -2.347428 -0.690701
C  1.049448 -1.897976 1.256128
C  1.637318 0.255774 0.013626
C  -1.966061 -2.485885 -0.991639
C  2.075337 -0.939838 0.647393
C  -2.774748 -1.258453 -0.582302
C  -0.139295 2.087958 0.304921
C  -3.034323 0.792969 0.781982
C  2.609064 1.082514 -0.604819
C  -4.126195 -1.149457 -1.029272
C  3.456283 -1.236347 0.710563
C  -4.351218 0.869416 0.335455
C  -4.885648 -0.080086 -0.559499
C  3.982766 0.778774 -0.558894
C  4.419234 -0.381723 0.14157
C  -6.588449 1.336291 0.063424
C  5.663182 1.0847 -2.298667
C  6.630418 0.211925 0.97252
H  -0.69926 -0.05981 1.801622
H  -0.152584 0.539418 -1.153855
H  0.015887 -3.344927 -0.706606
H  0.036632 -1.739744 -1.485738
H  1.393829 -2.943091 1.144431
H  0.958485 -1.704801 2.344962
H  -2.35378 -3.356108 -0.425745
H  -2.117163 -2.706161 -2.06681
H  -1.125044 2.39496 -0.098462
H  0.636027 2.755561 -0.1189
H  -2.620347 1.513725 1.493829
H  2.320892 1.983381 -1.158658
H  -4.555596 -1.892122 -1.708655
H  3.811088 -2.145074 1.211225
H  -0.029213 3.126563 2.050362
H  -7.096818 2.142062 -0.487166
H  -7.206026 0.910429 0.878361
H  4.981796 0.793927 -3.121046
H  6.237618 0.203343 -1.961028
H  6.341413 1.882302 -2.638758
H  6.312179 0.250819 2.031733
H  6.572886 1.221819 0.527562
H  7.655498 -0.183396 0.903743
