program: Gaussian 09
title: 000151622
version: EM64L-G09RevD.01
frameworkgroup: C1[X(C6H4ClN3O3)]
method: RPBEPBE
basis: SDD
operation: Freq
keyword: #p
keyword: freq=noraman
keyword: PBEPBE/SDD
title: #p freq=noraman PBEPBE/SDD
converged: YES YES NO NO
title: Mulliken charges:
elementType: Cl O O O N N N C C C C C C H H H H
charge: -0.000876 -0.266799 -0.179431 -0.190859 0.087958 0.034827 -0.613868 0.344103 -0.308076 0.365230 -0.401318 -0.399372 0.198479 0.348976 0.309911 0.322663 0.348452
chargesum: 0.00000
title: Mulliken charges with hydrogens summed into heavy atoms:
elementType: Cl O O O N N N C C C C C C
charge: -0.000876 -0.266799 -0.179431 -0.190859 0.087958 0.034827 0.057247 0.344103 0.040900 0.365230 -0.401318 -0.089461 0.198479
polarizability: 1.66344250e+02 1.84457329e+00 1.21292254e+02 6.40191744e-02 -4.58885556e-02 4.00797446e+01
1716.lowfreq: 0.0031 0.0031 0.0035 3.4955 7.6709 8.6969 32.3492 43.8222 69.1637
frequency: 32.3280 43.8146 69.1599 143.7648 150.8892 233.7711 286.2267 294.3352 304.6779 345.7429 434.1102 462.4040 483.1994 493.0531 560.2519 579.0134 584.6370 626.8972 660.7419 683.7140 727.4023 728.7229 771.2644 875.9286 953.0241 1009.1446 1017.5502 1074.5030 1100.1396 1105.1530 1202.6018 1220.0372 1327.9487 1332.9288 1378.0731 1384.5324 1406.9018 1521.9017 1571.4526 1593.4590 1638.1066 3165.2706 3186.2562 3488.5012 3646.9167
redmass: 6.1795 13.7893 10.0303 5.8086 11.3051 15.1358 8.3180 19.7547 7.7324 5.4695 3.7734 11.3773 3.8301 9.9451 4.8860 1.2234 4.5840 1.4667 6.7801 4.0698 5.2747 11.7176 6.6367 8.5214 1.4727 1.3936 5.4441 1.9458 1.6987 8.0317 3.0610 3.3597 2.7009 10.0769 6.7143 2.9455 6.1232 6.6967 3.4993 2.8844 2.2814 1.0921 1.0939 1.0469 1.1035
irintensity: 10.7436 0.2878 0.5733 3.5061 0.4299 6.3264 6.9742 4.1894 17.5979 6.1639 0.0804 12.8688 1.8494 17.2042 25.7752 30.1451 0.6102 199.9886 9.9354 71.0075 0.4320 9.7693 21.0206 41.5718 13.6063 17.7704 58.9226 6.7783 13.9685 44.1649 158.8723 150.6720 66.8078 10.7486 138.3064 163.4250 2.6165 19.3037 146.6262 48.3069 299.4950 25.2263 1.5930 49.5296 109.9255
temp: 298.150 k
press: 1.00000 atm
elementType: 17 8 8 8 7 7 7 6 6 6 6 6 6 1 1 1 1
symmnumber: 1
zpe: 274545.7 jmol-1
zpe.correction: 0.104569 hartree
zpe.thermalcorrener: 0.115914 hartree
zpe.thermalcorrenthalpy: 0.116858 hartree
zpe.thermalcorrgfe: 0.065250 hartree
zpe.sumelectzpe: -1080.012587 hartree
zpe.sumelectthermal: -1080.001242 hartree
zpe.sumelectthermalent: -1080.000298 hartree
zpe.sumelectthermalfe: -1080.051906 hartree
dipole: -4.5461 -1.2870 -0.0281
dipole: 4.7248
quadrupole: -82.0026 -93.8087 -79.8964
quadrupole: -7.2542 0.0470 -0.0169
quadrupole: 3.2333 -8.5728 5.3395 -7.2542 0.0470 -0.0169
hfenergy: -1080.1171562 hartree
pointgroup: C01 [X(C6H4Cl1N3O3)]
dipole: -1.6799265 -0.6702872 -0.428939 debye
dipolederiv: -0.8042116 -0.2420534 -0.1779551 -0.2722941 -0.2594744 -0.0810145 -0.1826758 -0.0746661 -0.0955184 -0.6497323 0.0926552 -0.044629 -0.0815461 -0.9338258 -0.099603 -0.0694682 -0.0642878 -0.3823673 -0.5654457 -0.1235392 -0.0860951 -0.105365 -0.7066651 -0.0848011 -0.0834473 -0.0890815 -0.2372487 -0.7833716 0.1622701 -0.0902568 0.0911735 -0.5259776 -0.0218938 -0.0988644 -0.0087168 -0.236491 -1.0309259 -0.0723038 -0.1729501 0.3501146 -0.3540356 0.0422911 -0.1143267 -0.0384326 -0.2055693 1.5792346 0.1105272 0.2860607 0.1696521 1.0987299 0.1484775 0.2931813 0.1387658 0.2731817 -1.0974532 -0.137557 -0.1065444 0.0049673 -0.4387206 0.0337096 -0.0863389 0.005018 -0.6776952 -0.4610403 -0.1112261 -0.1180449 -0.1360005 -0.3992823 -0.0922655 -0.1194055 -0.0872265 0.0369713 0.2731853 0.1114815 0.0727775 -0.1087581 -0.0657787 -0.0267911 0.0438525 0.0155901 -0.0139618 -0.4754936 -0.1226101 -0.1248322 -0.0483336 -0.1977554 -0.0468252 -0.1154035 -0.0626562 0.0508788 1.4220573 0.4633087 0.3293566 0.2325724 0.5759734 0.1206315 0.2967701 0.164721 0.11053 0.355459 0.0421419 0.0725403 0.0982294 0.290438 0.0590271 0.0788842 0.0475886 0.0282524 1.4323076 -0.1097104 0.2214583 -0.0473372 1.1389319 0.1216179 0.229403 0.1082929 0.2986596 0.2057245 -0.0380195 0.0021661 -0.0427046 0.1730273 -0.0075737 0.0000121 -0.0064095 0.1670981 0.0712593 0.0239471 -0.011699 0.0332201 0.1209291 0.0020788 -0.009638 0.0014022 0.1485975 0.2761873 -0.0481297 -0.0248835 -0.1176038 0.3255312 -0.0304671 -0.0336051 -0.0170767 0.3599612 0.2522594 -0.0011824 -0.0264693 -0.0199862 0.1579545 -0.0365983 -0.0289299 -0.0328248 0.3747211 unknown
polarizability: 160.7600235|3.9249324|120.5962818|23.9376719|11.8763749|46.3599437 unknown
InChI: InChI=1S/C6H4ClN3O3/c7-5-4(6(8)11)1-3(2-9-5)10(12)13/h1-2H,8H2
charge 0 multiplicity 1
17 atoms
Cl -2.560966 -1.938978 -0.937719
O  -1.6299 2.605955 -0.12156
O  2.970309 1.679184 0.620634
O  3.786672 -0.452156 0.501992
N  0.051471 -1.949908 -0.44056
N  2.832915 0.413522 0.428151
N  -3.263135 1.064402 -0.666228
C  -0.899958 0.312946 -0.307583
C  0.396186 0.796156 0.010472
C  1.478013 -0.094217 0.095193
C  -0.979702 -1.094564 -0.519605
C  1.284874 -1.473997 -0.135933
C  -1.969328 1.406219 -0.361084
H  0.514822 1.870763 0.183851
H  2.110373 -2.187316 -0.077432
H  -3.554306 0.106107 -0.86259
H  -3.946342 1.821684 -0.692201
