program: Gaussian 09
title: 000151620
version: EM64L-G09RevD.01
frameworkgroup: C1[X(C10H10O5)]
method: RPBEPBE
basis: SDD
operation: Freq
keyword: #pfreq=noraman
keyword: PBEPBE/SDD
title: #p freq=noraman PBEPBE/SDD
converged: YES YES NO NO
title: Mulliken charges:
elementType: O O O O O C C C C C C C C C C H H H H H H H H H H
charge: -0.313472 -0.260142 -0.443617 -0.255087 -0.188396 0.311606 0.182194 0.276901 -0.445909 -0.308113 -0.326371 0.105849 0.238443 -0.506855 -0.741162 0.286842 0.259645 0.278551 0.227544 0.241773 0.238760 0.245768 0.252685 0.258942 0.383621
chargesum: 0.00000
title: Mulliken charges with hydrogens summed into heavy atoms:
elementType: O O O O O C C C C C C C C C C
charge: -0.313472 -0.260142 -0.059996 -0.255087 -0.188396 0.311606 0.182194 0.276901 -0.159067 -0.048468 -0.047820 0.105849 0.238443 0.201222 0.016234
polarizability: 1.85562912e+02 -8.95756037e+00 1.39800029e+02 4.93635628e+00 3.12579269e+00 6.92520765e+01
1716.lowfreq: -7.8849 -1.0062 -0.0004 0.0007 0.0009 9.3335 18.3082 37.2395 45.4216
frequency: 18.1768 37.2119 45.4085 62.4617 76.4547 93.5865 117.5140 158.1590 210.1276 233.8466 249.8172 281.5968 313.1716 323.0176 358.4317 433.4573 465.3182 512.4237 520.7240 548.7570 554.5959 575.8498 600.7279 642.9845 677.4677 700.8284 738.4297 746.7241 805.0161 842.5996 902.3774 925.3417 971.4487 980.1816 986.2992 1037.3788 1039.1122 1090.3457 1111.7605 1135.1643 1155.3870 1158.7422 1182.9033 1246.7602 1257.6642 1324.1990 1381.2558 1385.9285 1414.7925 1438.9112 1450.7603 1452.5995 1463.6335 1470.7602 1490.7048 1570.5457 1617.6898 1641.7029 1685.2316 2990.3374 3007.9721 3094.9839 3098.9190 3129.3570 3145.2053 3164.8794 3167.1147 3188.2291 3534.7954
redmass: 3.7681 3.3774 1.7115 6.6712 2.0870 6.7416 5.0972 5.2360 2.5360 1.6667 3.7266 3.7083 4.4404 6.1083 7.3306 4.3880 3.7161 5.4118 3.0241 3.7852 4.0610 2.8408 1.8002 5.2986 5.4244 4.8187 5.4959 4.2016 6.2383 1.4967 5.3757 1.6229 8.7542 1.3448 2.1163 2.1781 1.9754 2.6740 1.2434 1.4754 1.7835 1.6409 2.3835 1.7834 2.2832 2.6075 3.3583 1.5196 3.2501 1.4654 1.0569 1.0487 1.0549 1.0512 2.8390 8.8085 6.7421 8.6168 10.3072 1.0311 1.0372 1.0971 1.1025 1.1047 1.1011 1.0889 1.0924 1.0970 1.0642
irintensity: 2.7803 2.1652 1.2839 4.9506 1.4090 0.9480 6.1764 1.8278 1.2222 1.8409 1.0729 3.8632 6.6021 2.4586 1.1532 12.0062 5.8921 9.2641 24.7717 8.8519 11.4814 80.2091 79.8387 15.6429 5.5523 20.3167 42.2654 11.3919 37.9630 30.2847 152.6410 31.7202 30.5529 0.4972 147.6434 114.5297 84.2345 121.5998 3.0011 56.5691 282.3680 142.1393 18.2848 55.0016 178.9961 177.3633 130.4656 19.7731 27.2544 7.1190 27.1921 13.5883 17.4256 45.9600 87.2396 10.1811 157.6740 272.2618 160.9101 62.4218 1.2295 7.0213 32.0114 22.9404 8.3637 1.4337 3.0803 2.2037 51.6209
temp: 298.150 k
press: 1.00000 atm
elementType: 8 8 8 8 8 6 6 6 6 6 6 6 6 6 6 1 1 1 1 1 1 1 1 1 1
symmnumber: 1
zpe: 481115.7 jmol-1
zpe.correction: 0.183247 hartree
zpe.thermalcorrener: 0.198386 hartree
zpe.thermalcorrenthalpy: 0.199330 hartree
zpe.thermalcorrgfe: 0.138388 hartree
zpe.sumelectzpe: -762.076024 hartree
zpe.sumelectthermal: -762.060885 hartree
zpe.sumelectthermalent: -762.059941 hartree
zpe.sumelectthermalfe: -762.120883 hartree
dipole: -3.1972 1.4971 -0.9989
dipole: 3.6689
quadrupole: -62.8499 -89.6064 -91.6798
quadrupole: 5.7227 3.1748 5.4013
quadrupole: 18.5288 -8.2277 -10.3011 5.7227 3.1748 5.4013
hfenergy: -762.2592709 hartree
pointgroup: C01 [X(C10H10O5)]
dipole: 1.1806154 0.6487144 0.51855 debye
dipolederiv: -1.1889273 0.6847439 0.0332025 0.9172391 -1.072548 -0.1782228 0.0667178 -0.2153748 -0.4523129 -1.5053018 -0.6274718 -0.0838754 -0.7395212 -0.6545181 -0.0457692 -0.1792712 -0.1266572 -0.3110343 -1.3701254 0.2334503 -0.1967608 0.4009066 -0.3691676 0.0758513 -0.2359159 0.0420376 -0.4763267 -0.7349917 -0.2036453 -0.0449019 -0.3238615 -1.1301638 0.0675189 -0.0399363 0.0678709 -0.3474144 -0.4416695 0.0543748 -0.2214122 0.2897836 -0.5431155 -0.1234424 0.1782101 -0.3992191 -0.7614656 0.6571683 -0.5065438 0.0521802 -0.7620053 0.0160905 -0.1044682 0.2690557 -0.1961008 0.0145284 0.9965136 0.692884 0.1158749 0.9224548 0.6552545 0.0470844 0.1281154 0.086656 0.1393271 -0.7857613 -0.3253559 -0.0698976 -0.4257389 -0.3591659 -0.0307314 -0.1082299 -0.0185294 -0.024456 0.2370942 0.2213535 0.035982 -0.0245359 -0.0104114 -0.0190733 0.0274072 0.0836215 -0.0655256 -0.5340624 -0.2894874 -0.023016 0.0299564 0.0589835 -0.0205145 -0.0190742 -0.0503974 -0.1676918 0.1587507 0.0930978 0.049426 0.2583281 0.2283786 0.0130251 0.0197577 -0.0225022 -0.1045958 2.1344026 0.3417044 0.2982469 0.4239822 1.4400429 -0.1177431 0.3298845 -0.0922355 0.3048529 1.0624189 -0.6206717 0.2331348 -1.1002901 1.2293149 0.3454048 -0.300102 0.6828436 1.074437 0.9326411 0.2371348 0.0100582 -0.0957251 0.1926243 -0.0037904 0.0214797 0.0167595 0.2884456 -0.2388336 0.1453123 -0.1467451 0.1693934 -0.0711258 0.0658558 -0.2226315 0.113348 -0.1436649 0.1347809 0.0112751 -0.0088492 0.0487933 0.0265018 0.0269558 -0.0063066 0.0094455 0.1401408 0.0865325 -0.0046528 -0.0108866 -0.0005164 -0.0499827 0.0222612 -0.0094011 0.0263005 0.1617352 0.0282365 0.0609871 -0.0300103 0.0520609 0.0923032 0.0173745 -0.0372313 0.0123343 0.153238 -0.0489565 -0.0355564 -0.0103979 0.1248091 0.0561377 -0.1142124 0.0694827 -0.0914928 -0.069085 -0.0493951 -0.0002201 -0.0204402 0.1247615 0.093144 0.0997249 -0.0682022 0.0888803 -0.0507429 -0.0345281 -0.0933745 0.0039692 -0.1298766 -0.0901374 0.0071603 0.0139372 0.0228285 0.123867 0.0535838 -0.0522209 -0.0400818 -0.1108358 -0.0103941 -0.0461692 -0.0142365 -0.0411502 0.1212302 0.0382405 0.0686244 0.014834 0.0868951 0.0371013 -0.0567084 0.0570039 -0.0830396 0.0397682 0.0627748 -0.0317168 0.0648006 0.0024411 0.0870697 0.0681277 0.0509807 0.0633942 0.01635 0.3494142 -0.054025 -0.0044342 -0.1388982 0.1477835 0.0045004 0.008506 0.0203785 0.3963955 unknown
polarizability: 182.4057188|11.36314|140.9248056|16.2720148|-0.8123451|71.284493 unknown
InChI: InChI=1S/C10H10O5/c1-6(11)15-9-5-7(10(12)13)3-4-8(9)14-2/h3-5,12H,1-2H3
charge 0 multiplicity 1
25 atoms
O  1.711129 -0.347298 0.820276
O  1.458265 2.585591 0.296527
O  -4.26463 -0.131499 -0.511622
O  -3.099913 -2.083095 -0.027806
O  1.878616 -1.735915 -1.072179
C  0.486046 0.253964 0.379789
C  0.419829 1.66603 0.192211
C  -1.911617 0.050097 -0.066383
C  -0.664151 -0.539498 0.244567
C  -0.844545 2.24728 -0.102274
C  -1.995068 1.459082 -0.232163
C  -3.090667 -0.837069 -0.187844
C  2.305982 -1.386887 0.040445
C  2.872532 2.171349 0.230718
C  3.488525 -1.950531 0.792027
H  -0.609382 -1.62324 0.38627
H  -0.877451 3.332794 -0.232272
H  -2.960031 1.915334 -0.466179
H  3.062066 1.559346 -0.669641
H  3.166772 1.617631 1.136501
H  3.426522 3.119558 0.161532
H  4.163944 -1.141551 1.118619
H  4.030649 -2.661124 0.152159
H  3.137353 -2.468693 1.701883
H  -5.013178 -0.782556 -0.579762
