program: Gaussian 09
title: 000151618
version: EM64L-G09RevD.01
frameworkgroup: C1[X(C16H13NO3)]
method: RPBEPBE
basis: SDD
operation: Freq
keyword: #p
keyword: freq=noraman
keyword: PBEPBE/SDD
title: #p freq=noraman PBEPBE/SDD
converged: YES YES NO NO
title: Mulliken charges:
elementType: O O O N C C C C C C C C C C C C C C C C H H H H H H H H H H H H H
charge: -0.308483 -0.196986 -0.452671 -0.391036 0.043871 0.335432 0.194796 0.272249 0.408125 0.275583 -0.105179 -0.268886 -0.464312 -0.398822 -0.532784 -0.380445 -0.379334 -0.228818 -0.229990 -0.673074 0.292355 0.232746 0.369307 0.216706 0.214409 0.293073 0.290067 0.237070 0.238082 0.298525 0.231569 0.217041 0.349813
chargesum: 0.00000
title: Mulliken charges with hydrogens summed into heavy atoms:
elementType: O O O N C C C C C C C C C C C C C C C C
charge: -0.308483 -0.196986 -0.102858 -0.021729 0.043871 0.335432 0.194796 0.272249 0.408125 0.275583 -0.105179 -0.268886 -0.171956 -0.166075 -0.101669 -0.087373 -0.089268 0.008252 0.008093 0.074061
polarizability: 3.51751405e+02 -4.74776209e+00 2.21439848e+02 7.08262204e+00 1.41704496e-01 8.32661483e+01
1716.lowfreq: -8.0337 -0.0009 -0.0007 0.0005 2.3675 8.3402 34.2159 52.6830 75.1145
frequency: 34.1319 52.5374 75.1099 118.7024 134.4008 161.2367 178.3594 194.1082 211.2178 250.4346 258.8166 278.0690 289.1803 307.4203 318.0397 340.8678 365.1721 397.9403 422.5752 424.9281 444.5995 468.5423 474.4822 526.5149 568.9568 592.6145 625.2746 652.4264 680.0986 687.3769 725.5789 739.9634 768.1916 778.7393 805.0528 842.4388 876.8990 885.8792 922.2064 927.0402 941.0572 960.8867 968.9642 983.3957 997.6876 1014.1194 1021.0447 1035.0394 1088.7777 1107.1022 1119.2148 1155.1894 1164.2822 1166.2089 1174.1806 1198.9379 1206.2163 1221.0697 1259.2767 1290.5067 1306.4297 1349.4751 1362.4141 1391.3708 1396.8477 1408.9959 1431.1483 1443.2968 1450.2727 1471.8413 1479.4569 1491.7054 1509.4223 1517.8959 1539.1137 1565.3267 1581.3686 1605.7089 1612.5014 1641.1117 2950.8621 2978.9388 3026.1128 3040.9775 3066.4564 3082.2011 3127.9891 3134.6751 3151.2213 3164.2760 3172.0651 3173.0006 3542.2507
redmass: 4.9140 4.3628 6.3276 4.6866 5.5944 4.8483 7.1966 4.1730 5.7040 1.0981 1.6156 3.7489 2.4739 5.3797 2.7282 4.0386 6.8720 4.4805 6.3356 3.8728 6.6637 6.2870 6.2942 4.7515 5.6771 5.9613 4.5420 6.0063 5.2848 5.1138 2.6077 4.6783 6.0220 5.8751 1.7043 1.9233 5.4395 1.8886 3.4356 1.3022 2.1147 2.1301 5.2643 1.4748 1.4014 1.3657 2.4102 1.9856 2.3183 2.6978 1.3657 1.4510 1.4678 1.5231 1.4244 1.4487 1.4004 1.7307 1.6377 2.2987 3.3979 2.7336 4.2667 5.4868 1.5375 7.1029 3.6703 1.5096 2.3584 2.6645 1.1100 1.0655 1.5332 1.9301 6.4327 5.3038 6.9016 7.0990 7.1453 1.5709 1.0394 1.0559 1.1062 1.0966 1.0867 1.0993 1.0900 1.0863 1.0906 1.0949 1.0956 1.0979 1.0664
irintensity: 2.8347 4.0033 0.9862 0.1995 0.8217 1.1388 0.7912 5.5676 15.4597 33.1701 59.9696 11.4001 18.9687 2.9669 4.3058 2.1530 9.4553 4.3391 15.6351 5.6131 0.1401 9.7529 0.9363 9.2909 1.8003 9.7754 1.8515 3.5700 1.1022 2.2471 55.4124 15.3686 5.0049 6.2971 19.4672 48.0121 7.0604 43.5392 82.7371 57.5052 2.0453 14.1114 82.3271 0.5748 5.9364 0.0060 33.6155 1.8679 2.5572 0.7506 11.0059 33.8135 4.9500 7.4142 8.4336 17.5633 6.4013 14.2635 11.7604 13.8723 398.4246 190.1033 114.7896 31.7031 10.8842 11.5844 30.2004 27.7699 9.8626 3.5877 4.4664 16.8438 12.6210 22.2610 345.2299 24.3458 17.8583 12.3605 13.8705 122.6134 85.5779 74.8225 36.3817 24.3643 72.3253 12.3576 21.9785 4.3312 10.6699 5.3066 16.7106 14.5277 3.7623
temp: 298.150 k
press: 1.00000 atm
elementType: 8 8 8 7 6 6 6 6 6 6 6 6 6 6 6 6 6 6 6 6 1 1 1 1 1 1 1 1 1 1 1 1 1
symmnumber: 1
zpe: 664202.7 jmol-1
zpe.correction: 0.252981 hartree
zpe.thermalcorrener: 0.269457 hartree
zpe.thermalcorrenthalpy: 0.270401 hartree
zpe.thermalcorrgfe: 0.209221 hartree
zpe.sumelectzpe: -896.545941 hartree
zpe.sumelectthermal: -896.529466 hartree
zpe.sumelectthermalent: -896.528522 hartree
zpe.sumelectthermalfe: -896.589701 hartree
dipole: -3.5553 -1.5017 -1.2878
dipole: 4.0687
quadrupole: -74.4847 -119.3050 -121.0538
quadrupole: -7.0836 6.4394 -1.2028
quadrupole: 30.4631 -14.3572 -16.1059 -7.0836 6.4394 -1.2028
hfenergy: -896.7989226 hartree
pointgroup: C01 [X(C16H13N1O3)]
dipole: 1.367501 -0.7152162 0.4251699 debye
polarizability: 351.9180647|-4.7645067|221.1184741|-2.0044293|6.7519472|83.4208621 unknown
InChI: InChI=1S/C16H13NO3/c1-17-14-9(8-18)6-7-12-13(14)16(20)11-5-3-2-4-10(11)15(12)19/h2-7,17-18H,8H2,1H3
charge 0 multiplicity 1
33 atoms
O  -0.467587 -2.442127 -0.049002
O  -1.592007 2.961711 0.135768
O  4.870148 -0.135917 -1.148658
N  2.061358 -1.949034 -0.065953
C  0.408069 -0.177974 0.034722
C  0.086782 1.220396 0.08027
C  1.812953 -0.601813 0.019643
C  -2.095314 -0.685986 -0.009656
C  2.839753 0.42294 0.103937
C  -2.415435 0.69962 0.039087
C  -0.680412 -1.16126 -0.009368
C  -1.329425 1.715804 0.089145
C  1.104146 2.187991 0.114297
C  2.453486 1.774922 0.132656
C  4.322516 0.13952 0.208579
C  -3.141664 -1.64134 -0.056472
C  -3.769984 1.115743 0.039997
C  -4.486645 -1.222004 -0.056325
C  -4.803475 0.160408 -0.007957
C  3.325565 -2.661444 -0.27804
H  0.822793 3.243928 0.141503
H  3.24304 2.534347 0.182002
H  1.179055 -2.512813 -0.065881
H  4.818359 1.034267 0.632697
H  4.528478 -0.71729 0.879204
H  -2.870602 -2.700509 -0.092511
H  -3.979154 2.189422 0.078403
H  -5.290396 -1.965282 -0.093839
H  -5.850215 0.482779 -0.008152
H  4.006803 -2.086413 -0.928987
H  3.09358 -3.62138 -0.771231
H  3.841422 -2.89557 0.675007
H  5.861211 -0.108543 -1.104484
