program: Gaussian 09
title: 000151617
version: EM64L-G09RevD.01
frameworkgroup: C1[X(C19H19NO4S)]
method: RPBEPBE
basis: SDD
operation: Freq
keyword: #p
keyword: freq=noraman
keyword: PBEPBE/SDD
title: #p freq=noraman PBEPBE/SDD
converged: YES YES NO NO
title: Mulliken charges:
elementType: S O O O O N C C C C C C C C C C C C C C C C C C C H H H H H H H H H H H H H H H H H H H
charge: 0.951004 -0.522531 -0.533506 -0.260304 -0.192397 -0.577696 0.073626 0.111747 0.480232 0.294342 -0.103491 -0.550036 0.276101 -0.552670 0.271373 -0.439344 -0.241137 -0.427850 -0.314647 -0.370994 -0.695631 -0.371990 -0.666896 -0.226392 -0.224754 0.355592 0.273691 0.274257 0.244757 0.220055 0.246867 0.292964 0.241555 0.235996 0.294888 0.224254 0.214408 0.250823 0.291892 0.235003 0.215162 0.217779 0.241981 0.241918
chargesum: 0.00000
title: Mulliken charges with hydrogens summed into heavy atoms:
elementType: S O O O O N C C C C C C C C C C C C C C C C C C C
charge: 0.951004 -0.522531 -0.533506 -0.260304 -0.192397 -0.222104 0.073626 0.111747 0.480232 0.294342 -0.103491 -0.002089 0.276101 -0.087858 0.271373 -0.192477 -0.241137 -0.134886 0.162904 -0.076106 -0.006145 -0.080098 0.001048 0.015589 0.017164
polarizability: 4.48777833e+02 8.04014508e+00 2.93879655e+02 1.11026923e+01 -1.66290849e+01 1.46980138e+02
1716.lowfreq: -9.5372 -7.1867 -4.2602 -0.0013 -0.0002 0.0007 12.0309 17.9567 29.4450
frequency: 11.1728 17.4757 29.1897 44.1418 62.5408 73.4346 81.8470 86.0618 92.1765 112.7971 130.7229 162.8363 166.1291 175.7680 195.6618 207.2140 221.8364 225.9048 236.7728 250.3659 259.3992 284.7554 300.4194 318.5621 361.7489 377.6445 379.6707 395.9701 409.5276 425.0037 444.9298 454.5121 466.9428 505.9391 529.3207 571.4657 577.4919 591.1585 611.7045 652.5280 671.9656 688.7456 723.9153 726.1349 759.3192 770.1639 783.9637 793.5775 806.5299 816.7398 847.5617 853.2156 878.0201 888.4283 901.8322 921.6977 940.2420 942.8341 985.5908 996.0584 997.8570 1001.8270 1016.0115 1032.7300 1036.7082 1042.2053 1063.1116 1070.4972 1081.3208 1099.6912 1106.4856 1166.1117 1171.4524 1191.9490 1201.5129 1210.4323 1228.5088 1236.8472 1251.2821 1258.5716 1284.0791 1290.1127 1308.8124 1316.0924 1335.3075 1341.9091 1379.1117 1386.6351 1391.7630 1397.6701 1408.8936 1410.5422 1439.0393 1454.7734 1471.5612 1472.6685 1476.5629 1478.0658 1489.1278 1489.7103 1501.9236 1525.3024 1540.4590 1567.5693 1580.2837 1598.4376 1610.5199 2983.0320 2983.4646 3005.8276 3007.4187 3029.0888 3048.9780 3057.3866 3058.6646 3078.6646 3085.9034 3087.6745 3095.4381 3134.4720 3138.8817 3139.6250 3154.1228 3165.5206 3166.1521 3174.6477
redmass: 4.1303 5.0916 4.7568 3.0085 3.5756 2.3542 4.1978 5.4973 5.0562 5.7154 5.8882 9.3971 4.9724 6.5571 4.9575 1.9242 2.4651 1.1664 2.6143 3.1927 3.6349 4.0253 5.3072 5.3674 6.4977 6.4447 4.4780 7.4983 6.2327 3.6112 6.9860 5.7880 7.6614 5.3874 4.7175 5.7018 5.3044 5.0475 6.0682 6.7675 5.9884 4.5699 2.8252 4.4108 1.0976 3.2849 1.3789 5.0662 1.7407 13.1509 1.3751 2.0550 6.6851 1.6420 1.8386 3.5480 2.0356 2.9485 2.5005 2.4826 1.6776 1.4914 1.3738 1.5912 3.0796 1.6346 1.8358 1.4142 2.2836 1.7172 2.1877 1.5202 1.1152 2.7129 2.0753 1.4320 1.4368 1.2283 1.9400 1.8206 2.0969 1.1328 3.9126 1.6606 1.4099 2.7081 1.3415 2.9519 1.1841 3.8017 2.3018 1.3812 2.8300 3.4648 2.1672 1.1567 1.0412 1.0406 1.0804 1.0643 1.0975 5.0565 5.5100 6.6136 5.8502 7.5952 7.0134 1.0351 1.0355 1.0628 1.0598 1.0777 1.0562 1.0987 1.1021 1.0990 1.1023 1.0994 1.1009 1.0897 1.0865 1.1099 1.0905 1.0949 1.0950 1.0998
irintensity: 1.1931 0.7008 3.2756 0.7261 0.4120 0.2681 1.3533 5.0403 0.0685 0.6600 0.1096 10.2639 1.6259 0.5357 28.1728 9.1005 7.2593 0.1052 0.1170 2.5778 1.8460 5.2356 1.0127 0.7517 21.3141 12.5150 0.3403 11.1893 23.5055 11.8583 58.3622 45.7279 1.7868 46.5320 5.2330 2.3898 1.6911 0.5291 14.7809 21.0298 6.6713 6.5358 50.9368 11.6995 4.2887 14.1092 6.8586 17.1007 25.9739 61.5289 11.5284 13.2088 32.0632 17.6074 15.6974 55.7116 1.7635 18.6632 98.6824 15.2089 7.1863 4.6535 0.1462 55.1172 12.5044 47.7254 24.6892 34.2639 1.0198 4.7674 31.9989 13.2982 7.6436 0.4112 11.8316 0.1088 1.0292 7.6041 5.1631 49.0647 63.2879 7.6302 606.7726 24.7819 25.5174 110.0357 27.5505 36.5035 8.3908 27.1596 16.8698 9.8043 7.3134 14.2954 22.3108 12.0878 16.6327 5.7553 12.2434 5.9434 11.4875 24.4178 197.0356 17.8463 7.7554 8.8995 1.3086 26.3763 60.0856 28.8313 9.1657 263.2273 5.5819 3.4707 0.7330 32.4503 34.6512 33.3345 24.7828 14.2560 3.6631 4.1388 6.8983 5.7998 3.3541 27.5276
temp: 298.150 k
press: 1.00000 atm
elementType: 16 8 8 8 8 7 6 6 6 6 6 6 6 6 6 6 6 6 6 6 6 6 6 6 6 1 1 1 1 1 1 1 1 1 1 1 1 1 1 1 1 1 1 1
symmnumber: 1
zpe: 886470.5 jmol-1
zpe.correction: 0.337639 hartree
zpe.thermalcorrener: 0.362040 hartree
zpe.thermalcorrenthalpy: 0.362985 hartree
zpe.thermalcorrgfe: 0.280907 hartree
zpe.sumelectzpe: -1487.194473 hartree
zpe.sumelectthermal: -1487.170071 hartree
zpe.sumelectthermalent: -1487.169127 hartree
zpe.sumelectthermalfe: -1487.251205 hartree
dipole: 2.0117 0.3594 3.4016
dipole: 3.9683
quadrupole: -119.5554 -150.0404 -165.2628
quadrupole: 15.7178 7.5805 -2.0871
quadrupole: 25.3975 -5.0876 -20.3099 15.7178 7.5805 -2.0871
hfenergy: -1487.5321118 hartree
pointgroup: C01 [X(C19H19N1O4S1)]
dipole: -0.8662637 -0.1708202 1.2875899 debye
polarizability: 449.4402088|-0.6556434|291.2636406|5.5242531|24.7453251|148.933776 unknown
InChI: InChI=1S/C19H19NO4S/c1-3-11-25(23,24)20-17-12(4-2)9-10-15-16(17)19(22)14-8-6-5-7-13(14)18(15)21/h5-10,20H,3-4,11H2,1-2H3
charge 0 multiplicity 1
44 atoms
S  -2.832571 1.057944 -0.844496
O  -2.361284 2.593715 -1.113905
O  -3.007642 0.033174 -2.099739
O  0.484097 1.697467 1.094283
O  3.78891 -2.335844 -0.679525
N  -1.675505 0.247891 0.556766
C  -0.780723 -0.769639 0.150635
C  0.648394 -0.533188 0.149036
C  -1.288834 -2.074503 -0.183443
C  1.535696 -1.580508 -0.252316
C  1.216209 0.76965 0.586004
C  -4.487392 1.124407 0.150644
C  2.683051 0.997504 0.451096
C  -2.757764 -2.437574 -0.047128
C  3.557296 -0.041048 0.021656
C  -0.369466 -3.074749 -0.574311
C  3.01848 -1.388047 -0.3206
C  1.017131 -2.838895 -0.624053
C  -5.581672 1.756736 -0.710838
C  3.213698 2.270833 0.777259
C  -3.204999 -2.536809 1.437708
C  4.948732 0.202742 -0.076121
C  -6.90594 1.844665 0.086302
C  4.598241 2.508862 0.67035
C  5.468406 1.472822 0.243659
H  -1.125631 1.087969 0.88801
H  -4.219431 1.71727 1.040357
H  -4.668115 0.071495 0.418471
H  -3.384772 -1.711869 -0.592683
H  -2.92557 -3.412648 -0.541176
H  -0.757438 -4.06684 -0.831554
H  1.721531 -3.616911 -0.933114
H  -5.265745 2.767959 -1.027328
H  -5.730628 1.154912 -1.626421
H  2.521967 3.051218 1.107909
H  -2.625077 -3.308317 1.975427
H  -4.27399 -2.812628 1.498254
H  -3.058128 -1.573635 1.955759
H  5.595055 -0.616921 -0.405159
H  -7.693774 2.299532 -0.539553
H  -7.258006 0.844988 0.400387
H  -6.790947 2.468315 0.991608
H  5.003511 3.495934 0.916533
H  6.544142 1.661267 0.162651
