program: Gaussian 09
title: 000151616
version: EM64L-G09RevD.01
frameworkgroup: C1[X(C17H15NO2)]
method: RPBEPBE
basis: SDD
operation: Freq
keyword: #p
keyword: freq=noraman
keyword: PBEPBE/SDD
title: #p freq=noraman PBEPBE/SDD
converged: YES YES NO NO
title: Mulliken charges:
elementType: O O N C C C C C C C C C C C C C C C C C H H H H H H H H H H H H H H H
charge: -0.309210 -0.200423 -0.393914 0.042000 0.179055 0.324452 0.406707 0.269720 -0.106645 0.274029 -0.270774 -0.557993 -0.463847 -0.423371 -0.382652 -0.380524 -0.678608 -0.229821 -0.230133 -0.659085 0.230612 0.225394 0.291050 0.236661 0.365202 0.292498 0.290345 0.230714 0.219941 0.226320 0.236737 0.237764 0.241375 0.232198 0.234225
chargesum: 0.00000
title: Mulliken charges with hydrogens summed into heavy atoms:
elementType: O O N C C C C C C C C C C C C C C C C C
charge: -0.309210 -0.200423 -0.028711 0.042000 0.179055 0.324452 0.406707 0.269720 -0.106645 0.274029 -0.270774 -0.101987 -0.172797 -0.186710 -0.090154 -0.090179 -0.001633 0.006916 0.007631 0.048713
polarizability: 3.57338187e+02 2.47552899e+00 2.25173894e+02 -8.42774644e+00 -3.48457103e+00 9.27014098e+01
1716.lowfreq: -0.0008 0.0002 0.0004 2.1290 4.7229 9.8740 33.1701 50.6165 73.3330
frequency: 33.1493 50.5670 73.3152 109.9029 128.2864 156.6957 178.2325 181.4376 193.0064 211.0867 244.4949 274.1693 280.7117 311.8843 330.0504 347.1180 367.9013 390.6355 423.6397 426.0490 446.5375 460.1503 472.5095 521.9909 571.9634 581.5102 617.4363 650.5495 680.2859 687.0654 725.2878 730.4577 762.4943 772.5144 792.0869 805.4648 845.7268 870.4536 886.1773 918.9660 939.3854 945.7970 970.2424 983.0885 998.1578 1003.4809 1014.2903 1034.8007 1057.0149 1072.6000 1090.9942 1105.1364 1112.1547 1156.7603 1164.1774 1169.9694 1193.8009 1206.2035 1239.1535 1254.4283 1283.5754 1306.3756 1313.0646 1342.1694 1363.2255 1388.1532 1389.6532 1404.6673 1427.5458 1439.0525 1449.0085 1468.8974 1471.1309 1475.9728 1477.1277 1490.4414 1508.3869 1512.4853 1533.1479 1564.0960 1579.5012 1602.3917 1611.2609 1645.0344 2966.6293 2982.5669 3010.4028 3044.7008 3055.7737 3068.3455 3081.7974 3085.1378 3093.0289 3124.4378 3134.6514 3151.1979 3164.0436 3168.5057 3172.6808
redmass: 3.7751 4.2170 5.0041 3.6384 3.7214 3.7203 6.0524 3.5034 3.3781 1.1297 1.1651 3.7012 4.8914 5.6929 4.0275 3.9538 6.0107 3.8475 4.2097 4.8847 7.1681 4.6486 8.4647 4.1072 6.0339 4.9615 4.4074 6.2617 5.3718 4.5536 2.4893 5.1404 4.4837 6.4563 1.2095 1.7076 1.8872 5.4770 1.6741 1.1901 2.0226 2.6626 5.2213 1.4436 1.3991 2.5802 1.3647 1.9764 1.8931 1.8670 2.1134 1.2932 2.6993 1.7668 1.5467 1.1533 2.9496 1.9121 1.2758 1.6472 2.0988 3.0940 1.7490 2.9843 3.7965 1.2246 7.0327 6.7678 3.8767 1.4366 2.6036 1.0478 2.2580 1.1651 1.0891 1.0589 2.2426 1.3038 7.6245 5.6328 7.0059 7.2922 6.5542 1.4881 1.0369 1.0349 1.0669 1.1000 1.0854 1.0949 1.0998 1.0982 1.0984 1.0897 1.0862 1.0906 1.0948 1.0943 1.0992
irintensity: 0.9378 5.2582 1.7191 0.2053 0.3619 2.9335 0.4750 1.4568 1.3404 0.5145 0.3996 1.8744 1.3147 0.8484 2.3260 2.9558 6.2755 2.4288 5.1606 11.3929 0.6885 0.5450 3.3699 6.7035 3.0555 0.5095 1.3087 7.4923 0.5823 1.2612 55.3169 1.3482 14.7086 1.4633 3.6846 23.0292 22.5427 2.7785 20.7194 83.6406 0.1018 3.8950 84.9043 0.7599 5.9716 2.2120 0.0062 3.5127 18.2189 21.4675 3.1067 1.7452 3.9750 3.0084 9.0135 7.6691 2.2121 3.1096 3.6155 3.6071 69.1868 368.6940 3.1707 271.5602 95.2331 14.5010 6.9447 0.2592 21.0248 31.2376 5.3969 16.4769 3.1882 3.9415 10.2770 7.3778 68.5104 36.8618 349.2156 26.1867 10.1322 7.4222 5.2139 78.8964 122.1931 35.9426 38.9552 37.7800 70.2982 2.1230 57.6334 28.2320 23.6584 25.9766 4.3275 10.6341 5.3452 4.5335 27.7431
temp: 298.150 k
press: 1.00000 atm
elementType: 8 8 7 6 6 6 6 6 6 6 6 6 6 6 6 6 6 6 6 6 1 1 1 1 1 1 1 1 1 1 1 1 1 1 1
symmnumber: 1
zpe: 727173.2 jmol-1
zpe.correction: 0.276966 hartree
zpe.thermalcorrener: 0.293731 hartree
zpe.thermalcorrenthalpy: 0.294675 hartree
zpe.thermalcorrgfe: 0.232810 hartree
zpe.sumelectzpe: -860.640320 hartree
zpe.sumelectthermal: -860.623555 hartree
zpe.sumelectthermalent: -860.622611 hartree
zpe.sumelectthermalfe: -860.684476 hartree
dipole: 2.9833 -2.0276 -0.2288
dipole: 3.6144
quadrupole: -87.2886 -120.8038 -120.1077
quadrupole: 4.9512 -2.6659 1.5894
quadrupole: 22.1114 -11.4038 -10.7076 4.9512 -2.6659 1.5894
hfenergy: -860.917286 hartree
pointgroup: C01 [X(C17H15N1O2)]
dipole: 1.1103635 -0.8803449 -0.1191427 debye
polarizability: 355.8064906|-7.282266|225.3005415|-19.8352121|-5.4063106|94.1064589 unknown
InChI: InChI=1S/C17H15NO2/c1-3-10-8-9-13-14(15(10)18-2)17(20)12-7-5-4-6-11(12)16(13)19/h4-9,18H,3H2,1-2H3
charge 0 multiplicity 1
35 atoms
O  -0.417166 -2.414085 0.085118
O  -1.606525 2.976708 -0.136266
N  2.079969 -1.916286 -0.287017
C  0.425514 -0.14671 -0.145561
C  1.823554 -0.559791 -0.284049
C  0.086346 1.249315 -0.197075
C  2.845532 0.467432 -0.392226
C  -2.059015 -0.671475 0.139564
C  -0.645918 -1.136469 0.025301
C  -2.39333 0.710856 0.090706
C  -1.32533 1.734296 -0.082507
C  4.343364 0.196129 -0.295106
C  1.088656 2.216191 -0.375418
C  2.439853 1.813926 -0.456804
C  -3.088588 -1.632144 0.306021
C  -3.74558 1.117874 0.206378
C  4.780751 -0.122638 1.162016
C  -4.43136 -1.221655 0.419378
C  -4.76245 0.157408 0.369458
C  3.262837 -2.648061 -0.747358
H  4.670702 -0.616461 -0.962989
H  4.881341 1.101901 -0.631069
H  0.797073 3.268938 -0.425336
H  3.219097 2.580426 -0.547643
H  1.209066 -2.474831 -0.122883
H  -2.806567 -2.688433 0.342997
H  -3.966054 2.189166 0.164479
H  4.552979 0.727392 1.829708
H  5.867655 -0.318325 1.209597
H  4.251253 -1.006451 1.560731
H  -5.222206 -1.968832 0.546645
H  -5.807441 0.473286 0.458138
H  4.134633 -2.540589 -0.076449
H  3.566442 -2.351709 -1.769665
H  2.997311 -3.718299 -0.775913
