program: Gaussian 09
title: 000151613
version: EM64L-G09RevD.01
frameworkgroup: C1[X(C26H20O7)]
method: RPBEPBE
basis: SDD
operation: Freq
keyword: #pfreq=noraman
keyword: PBEPBE/SDD
title: #p freq=noraman PBEPBE/SDD
converged: YES YES NO NO
title: Mulliken charges:
elementType: O O O O O O O C C C C C C C C C C C C C C C C C C C C C C C C C C H H H H H H H H H H H H H H H H H H H H
charge: -0.252669 -0.279423 -0.457714 -0.454296 -0.452683 -0.415200 -0.200132 -0.135659 -0.187102 -0.121467 -0.039025 -0.091838 0.011326 0.310623 0.208295 -0.009098 0.523487 0.482287 0.314889 0.181206 -0.474388 0.491575 0.475340 -0.826577 -0.446356 -0.454840 -0.507063 -0.418287 -0.529279 -0.483928 -0.469352 -0.468320 -0.244967 0.228453 0.257048 0.263554 0.223331 0.251246 0.279545 0.249682 0.369260 0.365867 0.369114 0.243671 0.249668 0.242884 0.252958 0.237183 0.237608 0.243529 0.241464 0.227673 0.386900
chargesum: 0.00000
title: Mulliken charges with hydrogens summed into heavy atoms:
elementType: O O O O O O O C C C C C C C C C C C C C C C C C C C C C C C C C C
charge: -0.252669 -0.279423 -0.088455 -0.088428 -0.083568 -0.028301 -0.200132 0.092794 0.069945 0.142087 0.184306 0.159408 0.011326 0.310623 0.208295 -0.009098 0.523487 0.482287 0.314889 0.181206 -0.194842 0.491575 0.475340 -0.576895 -0.202685 -0.205172 -0.264178 -0.165329 -0.292095 -0.246321 -0.225823 -0.226857 -0.017294
polarizability: 5.10991995e+02 7.48444071e+01 3.90239677e+02 1.61639744e+01 2.19253205e+01 1.49332968e+02
1716.lowfreq: -8.6118 -4.4575 -0.0006 -0.0003 0.0005 2.0897 19.0261 21.6164 25.2231
frequency: 18.7297 21.5090 25.2068 45.1233 51.1276 70.3928 79.1255 95.6388 104.8042 123.5719 151.3205 159.4238 166.1747 183.3754 204.8521 216.9854 225.1824 238.1503 263.9972 279.2425 289.7223 305.7363 312.0153 337.3162 350.0459 373.8794 380.2975 385.1703 403.8887 414.4051 429.6883 438.4230 449.2039 451.8582 462.5964 477.1821 507.2336 510.7392 512.0823 525.6355 529.4084 538.4872 544.7317 552.7701 568.4057 585.6510 605.5861 614.8254 617.0843 628.1570 635.1336 692.0541 695.2157 714.5221 721.0864 752.2670 769.2065 770.6117 797.6341 806.6125 813.7422 835.7386 847.9903 858.6607 870.7895 888.4352 893.7799 914.6428 924.7492 930.2926 931.6852 956.4782 966.6157 969.9677 977.9080 980.3016 986.2368 987.0878 991.9498 1023.3605 1031.6945 1032.8533 1058.0787 1066.6870 1075.3110 1079.2573 1082.6149 1110.2623 1116.7009 1125.3004 1154.0348 1171.3828 1178.8918 1181.5758 1197.3703 1207.0040 1210.4366 1224.0996 1232.8987 1243.2393 1256.3015 1259.0903 1268.6766 1276.8900 1289.2592 1304.1248 1307.2390 1312.9923 1313.7762 1330.4426 1353.4810 1365.6822 1375.5533 1394.1485 1394.4280 1398.8723 1403.7563 1406.0808 1413.3329 1426.0505 1434.7023 1446.5363 1465.2456 1486.7454 1497.0501 1519.2311 1570.9254 1586.9184 1600.0488 1609.4630 1624.1809 1636.9423 1683.2475 2933.1586 2960.2299 2990.5328 3007.7941 3019.2136 3119.0117 3121.1698 3123.0436 3126.7708 3132.5003 3134.1734 3145.0855 3156.7130 3157.9800 3168.7974 3188.6746 3512.0862 3562.4098 3572.4115 3573.6242
redmass: 6.1598 7.2059 7.1337 8.5728 6.3698 6.3298 5.5416 7.0291 7.0271 6.7504 5.3036 5.3670 5.9147 4.8452 3.7274 4.0749 4.3497 4.9923 5.5879 5.8978 5.1487 4.7106 5.4578 4.7869 3.7948 3.7368 1.4296 1.3200 5.3078 3.1898 1.3911 4.0458 4.2722 6.1908 3.3142 6.1177 5.7204 4.8569 3.8133 3.3588 5.9259 4.6940 4.8276 2.8698 5.2810 2.8673 3.4670 4.7730 5.3934 2.7092 2.7172 5.5065 3.9546 3.1361 5.4500 5.8623 1.3502 1.8930 5.7899 5.0359 1.4020 1.6558 3.6179 2.0464 2.4816 5.2679 1.7596 1.5271 7.5378 2.0880 4.6341 6.4008 6.8187 1.3939 1.4124 5.8506 1.5324 4.0951 1.4460 3.5133 4.4265 3.5138 2.9386 2.4963 3.1901 2.1263 1.9968 2.8300 2.6134 1.6139 1.3542 1.7370 1.3107 1.4983 1.3468 1.4709 1.1848 1.1937 1.6597 1.3183 1.7216 1.3988 2.0942 1.2519 2.1483 1.2875 1.9335 1.3119 1.2471 3.2048 1.6484 1.4671 1.6759 1.5219 2.1728 4.8021 1.7807 4.1640 3.1181 3.1083 3.6695 4.7102 4.5001 3.4483 4.5915 4.6461 5.9394 7.1938 6.2322 6.6952 6.5859 7.3356 9.4312 1.0835 1.0824 1.0835 1.0849 1.0855 1.0881 1.0893 1.0861 1.0879 1.0916 1.0888 1.0984 1.0981 1.0967 1.0964 1.0900 1.0640 1.0656 1.0659 1.0659
irintensity: 0.0965 0.4090 0.1206 1.7082 0.6672 0.8560 1.6111 3.8160 1.3147 0.3239 0.9288 2.8931 0.8439 2.8823 6.0386 9.0782 15.5145 0.4998 17.7620 3.8009 6.1234 0.2939 9.4137 5.8879 14.9004 20.3129 107.0264 164.8721 7.9973 11.5535 181.1355 20.8412 21.8864 9.3431 3.4295 2.0413 0.7755 13.0741 2.8119 2.1914 28.6447 12.1543 15.3544 3.6979 8.8684 96.8315 21.5607 2.4547 7.6467 39.6650 51.0693 4.6774 1.4364 19.7430 43.1310 1.4627 20.5522 20.3679 21.1139 0.8420 22.0300 2.1975 6.2584 7.6741 42.2300 48.0743 51.6625 2.6082 37.1248 49.8516 6.3332 76.0016 344.2683 3.4448 7.5545 0.9603 12.5868 59.5653 0.0134 57.6223 91.7237 14.6620 258.2954 98.5004 17.8012 10.7570 24.0769 3.9029 31.8462 2.1695 26.8105 200.3662 24.8845 96.4908 4.2045 33.9572 15.4398 32.6540 6.4544 12.9621 29.4801 6.1359 15.5697 14.1200 1.5590 80.1772 13.5681 9.0111 24.7129 1.8585 17.1076 20.9476 12.4206 3.1596 12.1933 12.3201 21.6277 1.0362 3.1527 2.9656 3.3717 26.0177 14.8846 97.3362 0.9123 8.9233 10.0351 7.1870 34.3391 14.5880 75.8948 15.9509 259.4990 21.4075 23.7615 9.0530 8.1188 50.7556 1.7124 8.1527 0.5170 3.3522 16.9809 9.5641 41.5265 37.3833 25.7727 13.8820 1.2215 25.0396 26.0428 27.7434 14.8863
temp: 298.150 k
press: 1.00000 atm
elementType: 8 8 8 8 8 8 8 6 6 6 6 6 6 6 6 6 6 6 6 6 6 6 6 6 6 6 6 6 6 6 6 6 6 1 1 1 1 1 1 1 1 1 1 1 1 1 1 1 1 1 1 1 1
symmnumber: 1
zpe: 1054074.0 jmol-1
zpe.correction: 0.401476 hartree
zpe.thermalcorrener: 0.428335 hartree
zpe.thermalcorrenthalpy: 0.429279 hartree
zpe.thermalcorrgfe: 0.343613 hartree
zpe.sumelectzpe: -1527.055798 hartree
zpe.sumelectthermal: -1527.028939 hartree
zpe.sumelectthermalent: -1527.027995 hartree
zpe.sumelectthermalfe: -1527.113661 hartree
dipole: -1.6093 1.8985 -1.5412
dipole: 2.9274
quadrupole: -176.9310 -166.2531 -201.7396
quadrupole: 12.7830 -8.1826 2.6706
quadrupole: 4.7103 15.3881 -20.0984 12.7830 -8.1826 2.6706
hfenergy: -1527.4572736 hartree
pointgroup: C01 [X(C26H20O7)]
dipole: 0.6311209 -0.7530294 -0.6009262 debye
polarizability: 512.0570993|74.1257915|389.1523937|-14.9853723|-22.3619166|149.3551467 unknown
InChI: InChI=1S/C26H20O7/c27-21-22(28)24(25(30)31)33-26(23(21)29)32-16-8-6-14-10-15-5-4-12-2-1-3-13-7-9-17(18(14)11-16)20(15)19(12)13/h1-11,21-24,26-30H
charge 0 multiplicity 1
53 atoms
O  -3.251825 0.270933 0.641285
O  -2.84226 -2.047105 0.382067
O  -7.107821 -0.104993 -0.939181
O  -5.247976 -2.293023 -1.259849
O  -5.787448 2.505342 -0.909886
O  -2.207533 3.130738 0.673041
O  -4.157355 3.019563 1.938965
C  -5.651689 0.042537 -0.949299
C  -4.954518 -1.18537 -0.346094
C  -5.348234 1.328195 -0.162392
C  -3.447527 -0.905706 -0.236747
C  -3.829047 1.487799 0.018443
C  3.191059 -0.407049 -0.042623
C  1.778956 -0.14575 -0.01908
C  0.849276 -1.250481 0.15319
C  4.129988 0.67108 -0.219652
C  3.690298 -1.764784 0.113633
C  1.371979 -2.593086 0.316794
C  -1.421698 -2.154384 0.34834
C  -3.470094 2.615704 0.983922
C  -0.569498 -1.06112 0.179334
C  3.657512 2.024263 -0.373685
C  5.550133 0.408577 -0.245387
C  2.779423 -2.818006 0.291846
C  1.336291 1.220396 -0.169493
C  0.455426 -3.682547 0.511242
C  5.122383 -1.995641 0.084088
C  -0.920533 -3.477832 0.52826
C  2.236698 2.260757 -0.340793
C  6.013488 -0.957281 -0.088052
C  4.598494 3.080625 -0.549746
C  6.452941 1.487044 -0.42267
C  5.979137 2.81187 -0.573751
H  -5.288136 0.164484 -1.994051
H  -5.337272 -1.391103 0.674398
H  -5.840811 1.274567 0.829204
H  -2.981675 -0.703979 -1.229397
H  -3.356021 1.683204 -0.96605
H  -0.995753 -0.05879 0.118731
H  3.155264 -3.841301 0.41545
H  -7.330854 -0.948895 -1.409426
H  -4.851525 -3.121398 -0.888616
H  -6.767757 2.434638 -1.035388
H  0.267712 1.453676 -0.144559
H  0.859851 -4.692538 0.642697
H  5.482309 -3.024368 0.203054
H  -1.627306 -4.300089 0.672467
H  1.87295 3.28865 -0.455388
H  7.093257 -1.145742 -0.108758
H  4.232696 4.107379 -0.666321
H  7.53023 1.284568 -0.441844
H  6.692901 3.631581 -0.709663
H  -1.959585 3.829392 1.33819
