program: Gaussian 09
title: 000151611
version: EM64L-G09RevD.01
frameworkgroup: C1[X(C26H20O7)]
method: RPBEPBE
basis: SDD
operation: Freq
keyword: #pfreq=noraman
keyword: PBEPBE/SDD
title: #p freq=noraman PBEPBE/SDD
converged: YES YES NO NO
title: Mulliken charges:
elementType: O O O O O O O C C C C C C C C C C C C C C C C C C C C C C C C C C H H H H H H H H H H H H H H H H H H H H
charge: -0.250307 -0.267042 -0.461241 -0.456973 -0.468558 -0.476165 -0.166215 -0.140748 -0.079414 -0.155833 -0.018436 -0.090491 0.002964 0.009879 0.280961 0.144526 0.320274 0.494935 0.522962 0.160914 0.151578 -0.450143 -0.450306 -0.410023 0.464573 -0.471774 -0.824428 -0.490318 -0.508862 -0.350086 -0.460706 -0.261895 -0.251855 0.222676 0.247064 0.246053 0.223347 0.246387 0.294011 0.371007 0.228645 0.368724 0.277107 0.382684 0.242828 0.245695 0.240398 0.242290 0.227237 0.244308 0.227161 0.228686 0.401946
chargesum: 0.00000
title: Mulliken charges with hydrogens summed into heavy atoms:
elementType: O O O O O O O C C C C C C C C C C C C C C C C C C C C C C C C C C
charge: -0.250307 -0.267042 -0.090234 -0.088249 -0.085874 -0.074219 -0.166215 0.081928 0.167651 0.090219 0.204912 0.155896 0.002964 0.009879 0.280961 0.144526 0.320274 0.494935 0.522962 0.160914 0.151578 -0.156131 -0.221662 -0.132917 0.464573 -0.228946 -0.578733 -0.249920 -0.266572 -0.122850 -0.216398 -0.034734 -0.023169
polarizability: 4.99861439e+02 -8.73084608e+01 3.93956358e+02 -2.30861317e+01 -3.11601073e+01 1.55870189e+02
1716.lowfreq: -5.5820 -3.0412 -0.0009 -0.0005 -0.0002 1.2847 8.8482 17.9546 28.1302
frequency: 8.5876 17.6327 28.0616 41.5268 56.2282 66.1243 80.6505 96.3096 104.9892 110.1389 138.5220 157.9858 177.2742 205.7311 215.9738 224.5884 248.3150 265.7917 276.5182 281.4598 295.5689 310.6153 324.6545 332.3443 346.7883 361.0544 385.3967 397.6293 408.9737 412.8036 436.9223 446.6258 456.2946 461.1006 477.2057 497.8754 507.7778 516.8568 518.6881 530.7203 536.0097 537.8843 553.3299 557.9729 567.9453 579.6298 590.4411 608.1778 620.1038 630.0809 636.5892 682.2424 689.1384 690.5454 716.8694 727.3094 758.8649 777.9516 794.7604 812.0907 836.6349 842.7205 856.6929 862.5790 863.5376 865.8814 878.2829 884.8384 913.6857 939.3168 959.4594 962.8558 963.9113 968.5934 986.1674 990.4789 993.2555 994.8375 1016.1445 1020.3817 1029.5994 1036.6440 1049.7372 1053.7035 1065.4665 1067.5910 1087.6762 1095.6147 1116.3815 1130.1401 1157.1365 1170.1144 1177.5555 1179.0506 1193.0636 1210.0841 1215.6709 1220.0620 1223.8243 1227.6908 1251.5885 1254.8152 1260.0609 1266.9839 1288.9008 1294.2507 1301.5851 1306.4403 1320.0224 1329.1380 1332.1822 1343.6954 1375.7697 1382.2265 1399.7382 1400.9549 1403.2837 1406.7450 1410.8478 1422.0202 1431.1919 1444.6676 1465.5633 1478.3305 1500.3687 1519.3404 1564.1536 1582.4041 1598.0933 1606.3923 1624.1985 1635.0119 1703.8957 2925.1891 2951.3912 2958.3196 2990.7040 3009.5266 3117.5783 3119.6923 3121.4686 3133.2322 3133.5238 3144.6371 3148.6883 3156.5697 3162.6416 3166.6602 3179.7679 3486.3697 3522.0772 3550.8170 3559.4842
redmass: 7.5862 6.9093 6.5833 9.8052 6.2505 5.7251 5.2346 7.5262 7.1001 5.8849 6.1376 4.5858 6.2365 5.4453 4.4766 4.2256 4.8316 4.6793 5.4419 6.2165 5.0243 4.8259 7.5528 6.5449 4.8226 6.1018 3.0312 2.4007 4.4741 2.1075 1.9090 1.7880 7.4497 3.2402 5.2791 3.3873 3.7193 3.1076 2.3694 5.3527 3.1936 2.0758 5.0229 3.3248 3.5632 5.4987 2.6429 4.7887 2.1381 4.8904 5.0427 3.9430 3.5308 5.3760 4.6788 3.8818 1.2859 2.3539 5.0331 1.4086 5.7804 2.6893 1.7982 1.8130 4.7391 3.2113 1.8410 6.0513 6.8219 2.1598 1.5441 3.6164 1.9075 3.3638 1.3805 1.4629 1.3685 5.2194 4.7754 4.4115 2.8342 3.5815 3.9359 3.0735 2.7304 2.7646 3.0372 2.7567 3.0782 1.7803 1.3656 1.5799 1.2819 1.2540 1.3359 1.4561 1.2761 1.1943 1.6316 1.2341 1.2366 2.2502 1.8150 1.3860 2.0509 1.2704 1.2669 1.2037 2.8203 2.4447 1.3844 1.3815 2.6783 1.8295 2.6703 1.4922 2.0677 3.6770 2.4367 5.0752 3.5450 3.8178 4.0478 3.5087 4.7295 4.0444 5.8764 8.4441 6.1675 6.6986 6.4924 7.2134 9.8324 1.0804 1.0828 1.0839 1.0854 1.0852 1.0900 1.0864 1.0871 1.0885 1.0893 1.0983 1.0930 1.0901 1.0961 1.0974 1.0964 1.0653 1.0643 1.0656 1.0656
irintensity: 0.6184 0.1389 1.4924 1.2429 0.3510 0.9183 1.0632 2.3641 1.1940 1.0566 4.8399 1.4881 7.1915 1.3169 8.5968 1.0537 5.0223 3.8527 10.9361 2.6103 2.1693 1.5177 6.1491 1.0268 0.8396 5.3767 14.8058 50.8755 16.2368 63.2038 64.9221 102.3647 5.5140 6.8055 4.1077 2.3492 1.4853 19.4757 83.2450 3.3261 7.6556 43.6667 23.6938 13.2903 45.4484 24.8365 87.8077 21.9667 101.7252 4.6210 20.8295 18.4028 0.4420 3.8157 2.3213 10.5185 65.8220 30.0320 6.1279 5.5326 3.0305 12.7521 4.7237 35.1364 6.2995 13.0600 44.3911 4.3077 129.6469 37.4556 51.6354 134.4274 15.7616 228.1406 3.3669 2.1811 23.7635 421.0814 4.3267 57.6009 34.9976 41.1878 0.6195 82.1571 15.5086 12.2055 43.4079 118.5075 21.8799 8.1451 3.1314 51.4043 3.7858 42.4718 31.7095 30.1582 20.7635 13.8066 71.8136 2.1428 11.6732 50.5616 4.1829 16.9980 3.0984 14.2620 49.6114 17.4950 3.7793 26.1778 40.5350 22.9620 39.1028 6.5999 35.2583 17.3722 14.6991 0.3723 3.7441 4.3539 14.9885 4.3562 25.1281 7.0791 27.3799 2.4334 2.4898 7.8623 6.5240 21.3322 5.0259 1.1436 207.9681 17.3191 5.7184 32.7494 25.9336 53.8406 3.1766 0.3244 7.9163 12.9841 5.9534 41.3579 15.5763 28.0565 4.3857 36.8331 8.0593 83.5873 34.9438 20.7924 30.2726
temp: 298.150 k
press: 1.00000 atm
elementType: 8 8 8 8 8 8 8 6 6 6 6 6 6 6 6 6 6 6 6 6 6 6 6 6 6 6 6 6 6 6 6 6 6 1 1 1 1 1 1 1 1 1 1 1 1 1 1 1 1 1 1 1 1
symmnumber: 1
zpe: 1052991.9 jmol-1
zpe.correction: 0.401063 hartree
zpe.thermalcorrener: 0.427760 hartree
zpe.thermalcorrenthalpy: 0.428704 hartree
zpe.thermalcorrgfe: 0.342567 hartree
zpe.sumelectzpe: -1527.050461 hartree
zpe.sumelectthermal: -1527.023764 hartree
zpe.sumelectthermalent: -1527.022820 hartree
zpe.sumelectthermalfe: -1527.108957 hartree
dipole: 2.4273 2.6710 2.8186
dipole: 4.5793
quadrupole: -159.1601 -162.7975 -195.3239
quadrupole: 15.5144 1.9119 -3.7834
quadrupole: 13.2671 9.6297 -22.8968 15.5144 1.9119 -3.7834
hfenergy: -1527.4515245 hartree
pointgroup: C01 [X(C26H20O7)]
dipole: 0.9430258 -0.8087586 -1.3048257 debye
polarizability: 505.5510218|73.3178544|387.4059692|51.4683228|25.8180859|156.7309954 unknown
InChI: InChI=1S/C26H20O7/c27-21-22(28)24(25(30)31)33-26(23(21)29)32-18-10-7-12-5-6-14-11-13-3-1-2-4-15(13)16-8-9-17(18)19(12)20(14)16/h1-11,21-24,26-30H
charge 0 multiplicity 1
53 atoms
O  2.916917 -0.961689 0.173558
O  2.096062 0.788005 1.457566
O  6.843641 0.365076 0.82275
O  4.654044 2.165615 1.220508
O  6.393749 -1.655383 -1.146926
O  4.564834 -3.597564 -1.711766
O  2.432204 -3.489917 -0.788815
C  5.56276 0.153909 0.146643
C  4.486726 0.719763 1.083992
C  5.340424 -1.3280 -0.188427
C  3.093282 0.486643 0.48276
C  3.901062 -1.474954 -0.777082
C  -1.438633 1.566611 0.408949
C  -2.679747 0.888733 0.133165
C  -0.265178 0.800695 0.751353
C  0.943004 1.509133 1.020971
C  -2.755952 -0.543675 0.19271
C  -1.362939 3.007863 0.341255
C  -3.857372 1.672478 -0.208843
C  -4.018985 -1.208551 -0.089021
C  3.499466 -2.922899 -1.056312
C  -0.356753 -0.634803 0.799167
C  -1.557615 -1.273077 0.529526
C  1.019979 2.909623 0.956495
C  -5.17951 -0.405477 -0.425964
C  -0.130676 3.654206 0.613259
C  -5.068509 1.016481 -0.477555
C  -2.555672 3.758103 -0.002329
C  -3.748812 3.118372 -0.264324
C  -4.177885 -2.63241 -0.050445
C  -6.430688 -1.052689 -0.705488
C  -5.407701 -3.23743 -0.32732
C  -6.548343 -2.441443 -0.658524
H  5.542699 0.719306 -0.812396
H  4.542881 0.210816 2.0677
H  5.418912 -1.946111 0.730521
H  2.955139 1.085782 -0.444225
H  3.871326 -0.918581 -1.743693
H  0.542974 -1.208898 1.035614
H  7.553063 -0.030108 0.253304
H  -1.583219 -2.365365 0.570263
H  5.592594 2.325067 1.500561
H  1.973443 3.394844 1.189244
H  6.215834 -2.568737 -1.500599
H  -0.076508 4.747678 0.56477
H  -5.956568 1.607528 -0.734482
H  -2.486818 4.851232 -0.047972
H  -4.645237 3.694577 -0.521931
H  -3.324626 -3.269258 0.200517
H  -7.297465 -0.430231 -0.957894
H  -5.499748 -4.328505 -0.289993
H  -7.507476 -2.925155 -0.873138
H  4.291516 -4.532228 -1.916758
