program: Gaussian 09
title: 000151610
version: EM64L-G09RevD.01
frameworkgroup: C1[X(C19H28N4O5)]
method: RPBEPBE
basis: SDD
operation: Freq
keyword: #p
keyword: freq=noraman
keyword: PBEPBE/SDD
title: #p freq=noraman PBEPBE/SDD
converged: YES YES NO NO
title: Mulliken charges:
elementType: O O O O O N N N N C C C C C C C C C C C C C C C C C C C H H H H H H H H H H H H H H H H H H H H H H H H H H H H
charge: -0.262024 -0.426686 -0.221083 -0.331202 -0.295098 -0.390684 -0.366911 -0.363959 -0.597232 -0.409009 -0.013730 -0.157314 -0.211791 -0.650590 0.219013 -0.713186 -0.717410 0.131021 0.500816 0.244703 -0.383286 -0.452058 -0.463425 -0.233118 -0.225363 -0.239743 0.236708 -0.448595 0.238621 0.235354 0.205295 0.290354 0.285938 0.390853 0.261234 0.245185 0.215042 0.215235 0.211363 0.227607 0.210829 0.219561 0.333568 0.232059 0.239771 0.262108 0.271089 0.387645 0.230004 0.231183 0.233905 0.348836 0.218951 0.212814 0.271602 0.315229
chargesum: 0.00000
title: Mulliken charges with hydrogens summed into heavy atoms:
elementType: O O O O O N N N N C C C C C C C C C C C C C C C C C C C
charge: -0.262024 -0.039041 -0.221083 -0.331202 -0.295098 0.000169 -0.033343 -0.015123 -0.010402 0.064967 0.191565 0.133041 0.074147 -0.144171 0.219013 -0.071545 -0.059413 0.131021 0.500816 0.244703 -0.151227 -0.212287 0.069772 -0.003114 0.005820 -0.005837 0.236708 -0.016830
polarizability: 2.75516353e+02 1.27863873e+01 2.36239776e+02 1.35689457e+01 -2.07468088e+00 2.17507702e+02
1716.lowfreq: -2.1417 -0.0002 -0.0001 0.0003 2.0748 5.5381 12.2249 16.4071 19.0765
frequency: 12.0704 16.0969 18.8695 23.6398 31.3760 39.0959 42.8207 49.4290 54.5585 61.8753 66.9936 74.2028 80.0235 90.8547 102.9645 126.5567 140.0109 163.5345 175.0718 189.2697 194.8169 215.3041 229.3435 237.5644 251.0446 256.4095 259.1165 285.3368 295.1995 306.8722 332.2196 336.8451 365.0510 388.8321 403.3250 416.1779 425.5791 484.5853 498.2584 503.3696 531.2491 542.3481 554.3681 556.9179 572.8792 575.1033 604.7886 617.3667 639.8725 644.7887 668.3815 674.9843 706.2898 706.4006 721.9351 742.1357 752.2905 755.1890 778.5035 816.5779 840.9952 855.6293 862.3902 890.5802 905.2606 921.3467 925.6359 931.9328 946.2928 955.8056 962.0125 977.6039 983.8689 986.2163 989.8584 996.4847 998.0423 1024.9673 1030.8633 1061.6577 1076.4463 1092.3562 1104.8396 1120.4205 1127.6018 1131.6869 1155.4172 1173.6759 1177.5246 1181.0292 1186.3653 1189.6559 1198.5700 1204.5170 1216.1732 1226.9741 1236.9148 1237.9214 1247.6156 1260.2155 1279.6402 1290.9639 1309.5009 1316.7805 1320.7767 1327.6666 1342.7284 1343.8907 1348.4481 1360.7773 1373.7364 1381.1636 1381.7662 1398.6386 1440.3855 1455.1581 1461.6669 1471.0332 1472.4982 1472.8521 1477.6503 1482.8021 1484.1817 1487.0421 1493.8233 1506.9140 1518.0185 1579.3500 1592.2996 1597.5403 1614.3510 1622.3048 1646.8228 1663.5304 2873.5060 2955.8825 2968.3505 2968.7534 2972.0171 2973.6088 2986.1773 2999.3377 3006.2899 3012.7506 3013.5669 3057.2792 3062.7192 3066.9728 3069.0622 3071.8515 3074.5797 3110.5509 3114.7778 3134.3595 3146.4095 3165.4431 3385.8624 3467.5424 3479.7998 3518.6350 3523.0415 3620.5856
redmass: 4.7733 5.2018 4.1553 4.2849 4.3537 4.4839 4.7629 4.2408 5.4074 4.0970 6.1454 3.3912 5.3000 4.5726 6.0984 4.7839 5.1057 4.0191 2.8023 3.7384 3.3864 1.1819 3.2365 1.1086 1.4037 5.1870 3.1615 5.2342 6.1617 4.0452 2.6098 3.5277 2.6814 2.9236 2.8127 1.9658 4.2182 3.6014 3.5013 3.1630 3.2689 2.6413 2.7023 2.3480 2.7973 2.1540 1.5923 6.3433 3.0273 1.8042 2.3463 1.5319 1.9788 3.6570 3.9748 4.2422 1.7883 1.2585 3.2076 3.4117 2.5499 1.2746 2.0324 2.6168 3.6574 1.2139 1.6542 2.2621 2.8392 2.9105 1.7992 1.3990 2.0090 2.0234 5.9354 1.9682 1.3234 2.3749 2.2218 1.9293 3.5118 2.0129 3.2129 3.0687 2.0985 1.6445 1.8873 1.0731 1.6971 1.7081 1.5450 1.2281 1.3695 1.0962 2.3903 1.5670 1.2541 1.7528 1.3098 1.7071 1.4358 1.7201 1.3251 1.3669 1.6648 1.4526 1.4639 1.5117 1.5036 1.4702 1.5697 1.2120 7.2554 1.2082 2.1462 1.0824 1.1330 1.0487 1.0927 1.0755 1.3342 1.0618 2.2147 1.7706 1.0577 2.1334 1.7872 3.2482 5.9498 3.0828 6.1298 5.5835 1.7361 9.0579 1.0704 1.0871 1.0464 1.0708 1.0596 1.0360 1.0763 1.0648 1.0829 1.0634 1.0994 1.1026 1.1000 1.0997 1.1011 1.0990 1.0992 1.0887 1.0879 1.0895 1.0953 1.1013 1.0815 1.0480 1.0774 1.0642 1.0781 1.0962
irintensity: 0.3246 0.1479 0.0320 0.1210 0.4846 1.5687 1.1556 1.8223 0.4296 0.3705 8.4124 5.5472 0.8585 3.1715 10.8538 5.3347 2.7438 10.2325 10.9277 2.4353 0.4039 0.1627 3.3474 55.7596 0.2527 9.0963 5.9499 21.7486 11.4481 17.5168 1.1425 1.8036 1.8226 3.9738 0.1523 1.6776 1.5619 21.8942 30.4182 20.7161 50.8783 28.2750 31.8465 40.1043 47.1241 43.2446 287.4698 0.0655 37.0639 104.0084 21.6566 94.8524 41.9863 19.2419 2.3970 4.8482 47.5059 125.8417 35.3650 9.5106 5.3867 0.2387 9.1104 0.8962 7.9799 6.9495 1.0536 12.8853 22.0572 29.0796 10.7400 0.1479 2.5232 13.7350 0.5293 1.6150 0.2172 7.4624 7.4287 161.0682 20.3964 1.0501 4.6495 14.1716 2.6930 9.2128 23.4556 0.0660 6.2285 4.7500 3.6221 1.8606 4.0248 0.5371 6.8102 10.2887 5.8367 20.0115 0.8881 30.3180 4.2768 26.2981 5.1136 2.8136 9.6559 8.4808 30.9801 27.4393 12.1500 2.4385 20.3905 18.9895 0.6447 18.4976 6.6835 11.6900 68.9010 7.2809 26.2484 3.3471 277.9916 3.5082 27.6480 291.1692 27.5807 60.9317 384.2918 291.1819 5.9302 31.7444 7.6865 250.8539 7.7309 220.0077 83.6300 58.5850 39.0421 21.7165 26.1971 25.1356 13.3586 27.8967 5.3038 4.9530 14.0363 0.8597 10.5198 34.1621 8.0544 60.7704 64.6387 8.9646 11.1653 4.5699 32.1447 21.6096 161.9790 18.4323 100.6144 31.9602 44.9014 13.9062
temp: 298.150 k
press: 1.00000 atm
elementType: 8 8 8 8 8 7 7 7 7 6 6 6 6 6 6 6 6 6 6 6 6 6 6 6 6 6 6 6 1 1 1 1 1 1 1 1 1 1 1 1 1 1 1 1 1 1 1 1 1 1 1 1 1 1 1 1
symmnumber: 1
zpe: 1202945.1 jmol-1
zpe.correction: 0.458178 hartree
zpe.thermalcorrener: 0.488721 hartree
zpe.thermalcorrenthalpy: 0.489665 hartree
zpe.thermalcorrgfe: 0.390646 hartree
zpe.sumelectzpe: -1333.865773 hartree
zpe.sumelectthermal: -1333.835229 hartree
zpe.sumelectthermalent: -1333.834285 hartree
zpe.sumelectthermalfe: -1333.933304 hartree
dipole: 1.1664 -0.2806 -1.2434
dipole: 1.7278
quadrupole: -162.1494 -195.6184 -159.9295
quadrupole: -19.5816 3.1668 4.2111
quadrupole: 10.4164 -23.0526 12.6363 -19.5816 3.1668 4.2111
hfenergy: -1334.3239502 hartree
pointgroup: C01 [X(C19H28N4O5)]
dipole: 0.4905554 -0.2684362 0.3864862 debye
polarizability: 229.5303691|-11.8009148|277.1227541|-12.1985026|7.7152124|222.6107079 unknown
InChI: InChI=1S/C19H28N4O5/c1-12(2)8-15(19(27)28)23-18(26)14(9-13-6-4-3-5-7-13)22-17(25)11-21-16(24)10-20/h3-7,12,14-15,21-23,27H,8-11,20H2,1-2H3
charge 0 multiplicity 1
56 atoms
O  1.931868 2.095526 -1.85443
O  0.431379 3.882977 2.292588
O  -0.23506 5.758707 1.098764
O  -0.224132 0.119017 1.654204
O  -3.662017 -3.297656 0.887682
N  0.807885 2.360554 0.170936
N  0.71863 -0.68378 -0.311123
N  -2.293684 -1.57457 1.610554
N  -5.22914 -3.161249 3.139252
C  -0.887334 3.765631 -1.092459
C  -2.082432 2.857769 -0.705838
C  0.358303 3.721066 -0.145778
C  1.908491 0.199194 -0.245159
C  3.064326 -0.382024 -1.093848
C  1.554063 1.640205 -0.729294
C  -3.151066 2.928107 -1.823995
C  -2.706011 3.211258 0.665945
C  0.145052 4.569317 1.104192
C  3.381529 -1.832614 -0.758572
C  -0.233548 -0.701475 0.671503
C  3.928235 -2.187846 0.502593
C  3.122536 -2.864043 -1.697448
C  -1.325238 -1.770053 0.537723
C  4.201499 -3.536195 0.818926
C  3.39362 -4.217073 -1.3847
C  3.931439 -4.557393 -0.123294
C  -3.417969 -2.358841 1.710849
C  -4.375061 -2.008038 2.864382
H  -1.217983 4.820445 -1.156533
H  -0.525997 3.468928 -2.094768
H  -1.711871 1.812214 -0.654309
H  1.17819 4.212335 -0.709526
H  2.198717 0.256327 0.821824
H  0.498129 1.899112 1.040487
H  2.806716 -0.264612 -2.161938
H  3.944835 0.264318 -0.925283
H  -3.993178 2.24348 -1.612358
H  -2.725478 2.65234 -2.807052
H  -3.562657 3.952297 -1.909261
H  -2.006836 3.026714 1.501755
H  -3.605193 2.594254 0.850303
H  -3.011153 4.274378 0.698553
H  0.687894 -1.383476 -1.057647
H  4.147835 -1.403799 1.238579
H  2.72641 -2.604696 -2.688144
H  -1.820538 -1.702806 -0.451314
H  -0.876371 -2.782762 0.592063
H  0.278198 4.48934 3.066956
H  4.626637 -3.792127 1.795876
H  3.190844 -4.999597 -2.124402
H  4.143734 -5.603753 0.12202
H  -2.05878 -0.843549 2.292379
H  -3.775491 -1.718124 3.753227
H  -4.934845 -1.093396 2.546949
H  -6.136234 -2.957251 3.55861
H  -5.258597 -3.819312 2.3528
