program: Gaussian 09
title: 000151606
version: EM64L-G09RevD.01
frameworkgroup: C1[X(C3H2Cl2F2O2)]
method: RPBEPBE
basis: SDD
operation: Freq
keyword: #p
keyword: freq=noraman
keyword: PBEPBE/SDD
title: #p freq=noraman PBEPBE/SDD
converged: NO NO NO NO
title: Mulliken charges:
elementType: Cl Cl F F O O C C C H H
charge: 0.030720 0.030701 -0.127119 -0.127142 -0.166586 -0.166590 -0.298524 -0.298551 0.443352 0.339869 0.339869
chargesum: 0.00000
title: Mulliken charges with hydrogens summed into heavy atoms:
elementType: Cl Cl F F O O C C C
charge: 0.030720 0.030701 -0.127119 -0.127142 -0.166586 -0.166590 0.041346 0.041318 0.443352
polarizability: 7.52892084e+01 1.40557911e-02 5.71045363e+01 7.45381847e+00 6.50529614e-03 3.98361904e+01
1716.lowfreq: -0.0015 0.0008 0.0009 13.5111 18.3818 19.3009 63.5508 85.2695 188.1859
frequency: 63.5075 85.2165 188.1826 195.6839 289.6555 295.4209 372.0686 430.9819 467.5747 528.1239 641.4675 648.7472 729.2776 759.4094 778.9987 908.7510 917.0360 970.7213 1030.6567 1058.4549 1120.6262 1191.8318 1226.7097 1258.7975 1279.8229 3171.3052 3173.9565
redmass: 21.0579 17.6893 21.8013 8.8193 15.7197 21.1076 16.4479 15.8230 8.6280 16.4483 15.1537 10.0344 6.4614 9.2573 9.3175 9.1910 4.1799 4.9855 4.8705 12.6183 7.7746 1.1470 1.3596 1.2377 1.2516 1.0901 1.0928
irintensity: 0.0356 0.5694 0.5435 6.5419 1.3573 0.9948 0.7632 29.1884 6.7148 2.3127 34.8771 168.7405 30.8827 3.3672 3.8577 211.0981 182.0545 66.6205 133.1219 289.5530 487.7636 1.9698 1.9183 0.5924 8.4547 1.7773 0.0015
temp: 298.150 k
press: 1.00000 atm
elementType: 17 17 9 9 8 8 6 6 6 1 1
symmnumber: 1
zpe: 142253.8 jmol-1
zpe.correction: 0.054182 hartree
zpe.thermalcorrener: 0.062499 hartree
zpe.thermalcorrenthalpy: 0.063444 hartree
zpe.thermalcorrgfe: 0.019439 hartree
zpe.sumelectzpe: -1385.047952 hartree
zpe.sumelectthermal: -1385.039635 hartree
zpe.sumelectthermalent: -1385.038691 hartree
zpe.sumelectthermalfe: -1385.082695 hartree
dipole: 0.0029 -2.9797 0.0001
dipole: 2.9797
quadrupole: -69.7288 -65.4754 -64.0240
quadrupole: -0.0035 0.2805 0.0001
quadrupole: -3.3194 0.9340 2.3854 -0.0035 0.2805 0.0001
hfenergy: -1385.1021341 hartree
pointgroup: C01 [X(C3H2Cl2F2O2)]
dipole: -1.1722944 0.0012434 0.0000386 debye
dipolederiv: -0.2410108 -0.146585 0.0520861 -0.2445663 -0.6543194 0.1206092 0.1383119 0.1503167 -0.1955849 -0.2401083 0.1456063 -0.0518116 0.2435976 -0.6552212 0.1207511 -0.1379785 0.1506536 -0.1956231 -0.684122 0.2168662 -0.1352613 0.2969507 -0.5307132 0.1595305 -0.1679901 0.091442 -0.3355749 -0.6850952 -0.2165129 0.1355579 -0.2967005 -0.5297705 0.1593019 0.1682085 0.0911199 -0.3356364 -1.2205885 -0.436217 0.0118041 -0.1855264 -0.5711585 -0.066052 -0.1766811 -0.1188933 -0.4645028 -1.2190657 0.4375565 -0.0120002 0.1868494 -0.5725648 -0.0660025 0.176365 -0.1191773 -0.4645317 0.8958154 0.503837 -0.1852156 0.3160133 0.9270496 -0.1941306 -0.4099939 -0.2840531 0.3293576 0.8937679 -0.5036504 0.1848266 -0.315914 0.9289846 -0.1945789 0.409398 -0.285056 0.3293954 2.4003567 -0.0007424 -0.0001302 -0.0005488 1.6820092 -0.1684017 0.0002891 0.2585204 1.1994415 0.0499428 -0.0290216 0.0023739 -0.0305847 -0.0120875 0.0644847 -0.0255734 0.0325912 0.0666241 0.0501077 0.0288633 -0.0022298 0.0304298 -0.0122082 0.0644884 0.0256446 0.0325359 0.0666353 unknown
polarizability: 57.1045527|0.0216841|74.2872892|-0.0108682|-9.4908382|40.838093 unknown
InChI: InChI=1S/C3H2Cl2F2O2/c4-1-2(5)9-3(6,7)8-1/h1-2H
charge 0 multiplicity 1
11 atoms
Cl -1.599522 -2.202311 0.175712
Cl -1.594318 2.205859 -0.175845
F  1.916959 -0.97914 0.551246
F  1.918646 0.975321 -0.551457
O  0.238032 -0.531043 -1.042315
O  0.239171 0.53024 1.042441
C  -1.130087 -0.532857 -0.559226
C  -1.12887 0.535314 0.559228
C  1.078025 -0.001169 -0.000033
H  -1.80358 -0.35615 -1.404115
H  -1.802857 0.360237 1.404064
