program: Gaussian 09
title: 000151602
version: EM64L-G09RevD.01
frameworkgroup: C1[X(C22H21N3O3S)]
method: RPBEPBE
basis: SDD
operation: Freq
keyword: #p
keyword: freq=noraman
keyword: PBEPBE/SDD
title: #p freq=noraman PBEPBE/SDD
converged: YES YES NO NO
title: Mulliken charges:
elementType: S O O O N N N C C C C C C C C C C C C C C C C C C C C C C H H H H H H H H H H H H H H H H H H H H H
charge: 0.954910 -0.318845 -0.547330 -0.559366 -0.482421 -0.034301 -0.470029 0.226947 0.240258 0.224154 0.270528 -0.091314 -0.105341 0.269565 0.162905 -0.384632 -0.338046 -0.279963 -0.406794 -0.392819 -0.307477 -0.308460 -0.539554 -0.257353 -0.265259 -0.232683 -0.237436 -0.620690 -0.530659 0.347130 0.234026 0.266672 0.273395 0.299965 0.263156 0.231020 0.267353 0.267341 0.262532 0.260217 0.230977 0.229704 0.234641 0.234048 0.259601 0.250453 0.226084 0.232443 0.248673 0.242077
chargesum: 0.00000
title: Mulliken charges with hydrogens summed into heavy atoms:
elementType: S O O O N N N C C C C C C C C C C C C C C C C C C C C C C
charge: 0.954910 -0.318845 -0.547330 -0.559366 -0.135291 -0.034301 -0.206872 0.226947 0.240258 0.224154 0.270528 -0.091314 -0.105341 0.269565 0.162905 -0.150606 -0.071374 -0.006568 -0.106829 -0.161799 -0.040125 -0.041119 -0.016805 -0.026376 -0.035555 0.001958 -0.003389 0.115447 0.192534
polarizability: 6.52687465e+02 -4.58824970e+01 3.68601618e+02 -1.13890614e+01 3.74571719e+00 1.90104492e+02
1716.lowfreq: -4.4131 -1.4679 -0.0016 -0.0015 -0.0008 7.8127 16.1155 17.6527 20.9704
frequency: 16.0659 17.3232 20.9509 33.5995 40.5265 47.3411 53.6781 81.1130 91.5603 111.6004 114.7608 118.5175 138.6536 147.3166 166.2663 178.2124 184.1139 202.6359 226.9704 236.2543 244.6586 262.2714 272.5053 277.1500 297.9404 323.1397 325.0862 379.9767 395.0703 397.4510 402.4383 435.3419 447.2514 454.2154 463.9183 476.4362 496.6067 504.8170 528.4450 539.4241 550.6364 579.5063 594.7050 595.9324 617.8180 633.2335 644.9113 658.8333 704.7121 712.4690 719.6428 747.1672 767.6109 773.4586 778.1149 789.0252 801.8720 804.6939 810.2546 848.6045 856.6576 867.6708 868.3039 873.8007 880.8607 917.7541 927.4910 930.3213 935.2513 966.0353 968.5989 970.3584 995.4173 996.4425 1001.4965 1018.8340 1021.9514 1035.0577 1060.5416 1075.2901 1109.5326 1118.4234 1123.0687 1152.5255 1155.3694 1161.3922 1174.5960 1178.6185 1182.9205 1218.7102 1227.8335 1235.1181 1238.9543 1250.7546 1281.6874 1284.4349 1291.8327 1317.3051 1351.8911 1369.4272 1386.6825 1392.4013 1397.0064 1416.4064 1427.1192 1435.6971 1441.2379 1453.0681 1454.9723 1457.1473 1467.6937 1467.8821 1477.4200 1481.4128 1484.2299 1513.3997 1524.6689 1548.1950 1550.0371 1574.2303 1604.6402 1611.3337 1631.0626 2977.7321 2988.1512 3043.3600 3072.8976 3081.7297 3104.2749 3128.3078 3128.5421 3132.8371 3135.4791 3137.8231 3140.8501 3147.8992 3157.2364 3165.5327 3171.0915 3171.9896 3173.8380 3190.6725 3334.7227 3482.4280
redmass: 5.1741 5.1173 6.5926 3.3206 4.0396 4.5703 4.2646 4.7182 4.7474 3.9720 7.4170 4.5287 4.8089 6.5335 4.6961 4.2887 1.3924 2.3343 2.3114 3.9606 3.9901 2.1516 3.6841 3.9306 4.4547 5.8666 7.4014 4.8353 3.8418 5.0414 4.6502 4.7906 4.8869 3.8845 4.8745 3.0026 9.1085 3.3235 7.7122 4.6496 4.8821 3.1794 2.9636 3.8467 4.2049 3.5966 2.8714 5.5141 5.0537 5.0359 3.8458 3.4069 1.6103 1.3707 1.2000 3.4736 1.4980 5.7328 3.9352 1.9542 2.9081 1.8240 3.0563 1.5323 2.1914 4.3842 2.2277 2.6199 2.9255 1.3587 1.5049 1.3553 1.3226 1.3291 3.9957 2.2849 2.0314 1.4470 2.6966 4.5447 2.0468 1.3347 1.7936 1.3340 1.3775 1.1880 1.3439 1.6671 1.2043 1.6744 1.6364 1.2566 1.2565 2.9169 2.4632 1.6938 3.1759 2.5866 2.4982 2.2813 3.5369 1.1741 3.0624 1.1171 5.3840 1.5786 2.6898 2.4923 2.9562 1.0394 1.1941 1.4764 1.4252 1.0518 2.1136 4.0634 6.7560 6.2583 7.4039 3.7698 6.6128 5.7516 6.3881 1.0319 1.0372 1.0567 1.1048 1.0957 1.1021 1.0896 1.0853 1.0858 1.1016 1.1096 1.0893 1.0894 1.0952 1.0950 1.0946 1.0997 1.0995 1.0921 1.0752 1.0744
irintensity: 1.4941 1.7734 1.4671 0.9743 1.5788 1.2352 1.8248 1.4502 22.9440 16.5297 41.4601 31.3312 1.5824 3.0929 4.1491 30.4607 2.1886 10.2052 7.7686 2.9865 4.9593 1.2367 3.0257 11.6855 1.9795 6.1781 5.1618 68.2229 7.0611 8.3919 11.0676 7.6317 26.6498 2.2450 8.5599 3.5925 28.2045 1.8180 11.0634 19.0651 3.9553 22.8031 64.2314 36.9982 34.1027 51.0059 25.4957 1.2223 4.0942 21.4288 7.5984 4.5482 149.6121 9.6440 1.7706 2.7784 51.8828 93.2886 33.3387 77.6729 20.9877 46.6466 25.6714 1.2220 3.4089 33.4661 9.6550 1.9491 9.8680 1.1012 42.2210 2.9610 0.0681 0.3627 60.7114 3.6085 12.4465 5.1336 42.6916 6.9241 3.5879 15.4148 83.4021 3.4495 2.4656 1.3452 19.7522 49.4931 13.0336 26.9141 16.2961 1.1574 20.8218 9.5610 27.0725 8.5377 21.3218 99.7317 94.6306 70.7296 85.5564 24.5860 28.5616 5.4775 180.8885 5.9856 21.2210 0.7715 10.5010 13.7896 41.5756 74.3826 23.5201 10.1222 119.4004 530.7779 41.7979 47.8378 55.7293 54.8688 334.2041 65.5422 7.4704 47.6400 23.2299 3.1600 25.9259 10.3889 4.0099 7.9391 0.1003 5.0416 16.8846 6.4123 12.8074 8.6692 20.0656 16.8392 7.2154 37.7651 20.4274 1.1816 14.6745 67.9152
temp: 298.150 k
press: 1.00000 atm
elementType: 16 8 8 8 7 7 7 6 6 6 6 6 6 6 6 6 6 6 6 6 6 6 6 6 6 6 6 6 6 1 1 1 1 1 1 1 1 1 1 1 1 1 1 1 1 1 1 1 1 1
symmnumber: 1
zpe: 1005716.5 jmol-1
zpe.correction: 0.383057 hartree
zpe.thermalcorrener: 0.410443 hartree
zpe.thermalcorrenthalpy: 0.411387 hartree
zpe.thermalcorrgfe: 0.322213 hartree
zpe.sumelectzpe: -1636.708656 hartree
zpe.sumelectthermal: -1636.681269 hartree
zpe.sumelectthermalent: -1636.680325 hartree
zpe.sumelectthermalfe: -1636.769500 hartree
dipole: 3.7406 1.3784 1.3687
dipole: 4.2149
quadrupole: -225.7782 -150.2847 -177.2641
quadrupole: -28.4402 -8.2133 -5.9508
quadrupole: -41.3359 34.1576 7.1782 -28.4402 -8.2133 -5.9508
hfenergy: -1637.0917127 hartree
pointgroup: C01 [X(C22H21N3O3S1)]
dipole: -1.5301031 -0.5853806 0.2567467 debye
polarizability: 640.2297856|-74.2327213|343.7226017|-15.0618397|75.0402419|227.441188 unknown
InChI: InChI=1S/C20H16N3O.C2H5O2S/c1-24-19-12-13(21)10-11-18(19)23-20-14-6-2-4-8-16(14)22-17-9-5-3-7-15(17)20;1-2-5(3)4/h2-12,21,23H,1H3;2H2,1H3
charge 0 multiplicity 1
50 atoms
S  5.736305 -0.395836 -0.572442
O  1.157029 1.344536 2.322659
O  7.160758 -0.226385 -1.346739
O  5.644519 -0.243884 1.050999
N  -0.815513 0.568483 0.775529
N  -4.626338 -0.66616 -0.809474
N  4.413159 1.042526 -1.337286
C  -2.047291 0.143174 0.221062
C  -3.1823 1.010763 0.335646
C  -2.213177 -1.146433 -0.379769
C  0.44767 0.614596 0.172863
C  -4.464286 0.540453 -0.179307
C  -3.531896 -1.484584 -0.912375
C  3.094825 0.859475 -0.876679
C  1.539686 1.050893 1.002513
C  -3.11264 2.327929 0.910478
C  -1.180127 -2.147443 -0.424269
C  0.711865 0.32267 -1.191858
C  2.833375 1.183752 0.492193
C  2.019492 0.407219 -1.700125
C  -5.621571 1.384797 -0.043318
C  -3.719475 -2.763342 -1.548187
C  5.050782 -2.199454 -0.986095
C  -4.254188 3.11932 1.021081
C  -1.408339 -3.383761 -1.022435
C  -5.523904 2.639051 0.551135
C  -2.683964 -3.689242 -1.610034
C  5.785441 -3.216458 -0.118368
C  2.207821 1.787442 3.249307
H  -0.84323 1.018098 1.696888
H  -2.147047 2.727073 1.240207
H  -0.209191 -1.935708 0.031766
H  -0.110476 0.023585 -1.846946
H  3.670523 1.52543 1.104589
H  4.514031 0.877662 -2.360513
H  2.208589 0.15831 -2.751581
H  -6.568189 0.995583 -0.430148
H  -4.713319 -2.971784 -1.955699
H  3.972018 -2.123583 -0.772962
H  5.245927 -2.29211 -2.06645
H  -4.184081 4.122204 1.456136
H  -0.613364 -4.137375 -1.037457
H  -6.411228 3.27371 0.649895
H  -2.840796 -4.662363 -2.087974
H  5.647895 -2.992313 0.953075
H  6.866007 -3.229127 -0.340727
H  5.379569 -4.226811 -0.316919
H  2.647103 2.746259 2.916089
H  3.001652 1.022761 3.333921
H  1.703487 1.919403 4.217304
