program: Gaussian 09
title: 000151597
version: EM64L-G09RevD.01
frameworkgroup: C1[X(C15H10Cl2O3)]
method: RPBEPBE
basis: SDD
operation: Freq
keyword: #p
keyword: freq=noraman
keyword: PBEPBE/SDD
title: #p freq=noraman PBEPBE/SDD
converged: YES YES NO NO
title: Mulliken charges:
elementType: Cl Cl O O O C C C C C C C C C C C C C C C H H H H H H H H H H
charge: -0.043204 -0.044205 -0.416609 -0.228381 -0.251131 -0.353246 0.395538 0.409766 0.335235 0.214330 -0.435599 0.212221 -0.450952 -0.308774 -0.391280 -0.098454 -0.231723 -0.252924 -0.234280 -0.503775 0.288232 0.261234 0.267270 0.374744 0.231753 0.280370 0.231074 0.247812 0.245665 0.249294
chargesum: 0.00000
title: Mulliken charges with hydrogens summed into heavy atoms:
elementType: Cl Cl O O O C C C C C C C C C C C C C C C
charge: -0.043204 -0.044205 -0.041865 -0.228381 -0.251131 -0.353246 0.395538 0.409766 0.335235 0.214330 -0.147367 0.212221 -0.189718 -0.308774 -0.124010 -0.098454 0.000030 0.027446 -0.003206 0.238996
polarizability: 2.62380144e+02 -2.15424936e+01 2.15420437e+02 9.75366193e+00 2.00403745e+01 1.09813981e+02
1716.lowfreq: -6.1050 -4.0119 0.0017 0.0023 0.0027 2.4665 31.0017 34.6748 51.2086
frequency: 30.9562 34.6633 51.2047 66.8017 96.9197 104.2253 139.0749 156.1400 164.3385 170.3278 195.6262 208.0857 226.0399 260.0049 291.2507 317.2645 344.5254 345.3842 383.4785 404.1485 434.0739 447.3051 476.8547 502.7311 529.4338 558.0088 569.2276 600.7898 606.5677 676.4774 688.8713 715.9458 746.5912 767.9530 778.0318 790.7229 810.0672 865.6626 878.5341 894.1248 900.9283 934.5394 956.1182 972.6018 993.2085 996.9793 1030.8391 1041.7910 1083.9717 1102.0440 1113.5956 1149.4766 1153.2893 1169.9218 1179.7256 1199.4407 1209.0395 1247.8271 1291.3572 1347.2376 1365.7091 1383.8224 1416.0083 1422.7277 1431.5617 1454.0817 1455.5350 1460.0406 1479.1798 1570.1374 1595.6942 1604.0537 1609.2366 1617.3297 3011.9049 3118.3871 3131.5316 3143.1710 3161.4721 3162.8588 3172.3509 3181.7278 3185.2403 3423.2840
redmass: 7.1067 8.8722 5.2684 5.2127 1.0796 4.6041 9.3315 6.4540 5.7901 12.5437 4.5931 6.8941 5.5225 8.5937 5.2470 8.8080 6.2458 4.9879 9.6689 6.4278 1.3887 2.8679 4.0281 7.6932 4.6759 6.3014 3.4199 5.6800 6.7470 6.9083 6.4623 6.6959 2.5568 5.7373 1.9149 7.9401 3.6321 1.4267 3.0350 1.5156 2.1226 8.4468 1.5621 4.1738 1.4597 4.4600 2.3298 5.8230 1.7774 2.0000 1.2618 2.8846 1.5637 1.5624 1.4884 3.0754 2.6148 2.3482 1.6086 1.8704 4.7571 3.7043 3.4944 1.2029 3.1150 2.5970 1.0529 1.0515 4.5175 8.9665 7.0396 8.7506 8.8265 7.3088 1.0293 1.1054 1.0860 1.0914 1.0972 1.1053 1.0935 1.0962 1.0933 1.0649
irintensity: 0.1665 0.5594 1.4441 0.8837 0.0223 0.2445 1.4095 0.6164 1.2550 0.2334 0.5966 6.0153 2.3378 10.6743 9.7921 3.3579 21.6181 8.3217 7.9791 2.6897 51.3321 10.5933 11.3676 16.4821 7.1558 2.3135 3.4529 4.1330 9.7791 8.9229 26.3065 4.9922 60.6846 2.4522 44.3515 55.0632 1.4309 22.8872 5.7170 6.4348 18.6032 10.6141 3.0194 11.0392 0.6105 6.6965 10.2953 52.8709 27.2241 27.8010 0.0813 99.4524 14.4805 64.4248 58.6872 124.5152 107.4620 1.7401 0.9653 25.3928 18.2562 21.3294 102.7272 23.6327 23.3659 11.0781 14.1829 10.3374 1.2782 58.1936 3.5044 101.8593 89.4292 11.1084 26.4014 16.1451 0.0720 11.2818 26.3778 8.2001 0.2008 9.9778 0.6406 73.5228
temp: 298.150 k
press: 1.00000 atm
elementType: 17 17 8 8 8 6 6 6 6 6 6 6 6 6 6 6 6 6 6 6 1 1 1 1 1 1 1 1 1 1
symmnumber: 1
zpe: 550039.4 jmol-1
zpe.correction: 0.209499 hartree
zpe.thermalcorrener: 0.227458 hartree
zpe.thermalcorrenthalpy: 0.228402 hartree
zpe.thermalcorrgfe: 0.162082 hartree
zpe.sumelectzpe: -1721.993243 hartree
zpe.sumelectthermal: -1721.975284 hartree
zpe.sumelectthermalent: -1721.974340 hartree
zpe.sumelectthermalfe: -1722.040660 hartree
dipole: -2.6345 -0.6784 3.1860
dipole: 4.1895
quadrupole: -121.4962 -122.6846 -128.5620
quadrupole: -0.7079 -2.4504 -6.5435
quadrupole: 2.7514 1.5631 -4.3144 -0.7079 -2.4504 -6.5435
hfenergy: -1722.2027418 hartree
pointgroup: C01 [X(C15H10Cl2O3)]
dipole: -0.9809678 -0.4382189 1.2499725 debye
polarizability: 265.5187228|-17.7204963|208.7038706|2.7508623|28.910824|113.3919692 unknown
InChI: InChI=1S/C15H10Cl2O3/c1-20-14(18)15(19)10-5-3-2-4-9(10)13-11(15)6-8(16)7-12(13)17/h2-7,19H,1H3
charge 0 multiplicity 1
30 atoms
Cl 1.692201 3.439034 1.018309
Cl 4.852134 -0.838157 -0.501532
O  -0.632047 -1.426315 -2.143557
O  -0.648828 -1.894346 1.484085
O  -1.281081 -3.255079 -0.296004
C  -0.556515 -0.950998 -0.769887
C  0.804175 -0.316627 -0.460467
C  -1.525937 0.199457 -0.457376
C  0.629169 1.014386 0.027629
C  -0.816162 1.335762 0.028124
C  2.06109 -0.903659 -0.6383
C  -0.860803 -2.16004 0.157504
C  -2.916889 0.213665 -0.617921
C  1.788836 1.736024 0.367575
C  -1.524326 2.505319 0.381246
C  3.188658 -0.129771 -0.289241
C  -3.625297 1.392293 -0.272238
C  3.07793 1.179927 0.217216
C  -2.932188 2.520764 0.227562
C  -0.969018 -2.991657 2.437932
H  2.168443 -1.912301 -1.04538
H  -3.445892 -0.660168 -1.013712
H  -1.000795 3.386301 0.759712
H  -1.017331 -2.348423 -2.113391
H  -4.713047 1.431665 -0.394989
H  3.966951 1.757433 0.480792
H  -3.491712 3.424416 0.493326
H  -2.040551 -3.242352 2.373254
H  -0.71295 -2.581662 3.423603
H  -0.36412 -3.882692 2.203129
