program: Gaussian 09
title: 000151595
version: EM64L-G09RevD.01
frameworkgroup: C1[X(C16H12N2O2)]
method: RPBEPBE
basis: SDD
operation: Freq
keyword: #p
keyword: freq=noraman
keyword: PBEPBE/SDD
title: #p freq=noraman PBEPBE/SDD
converged: YES YES NO NO
title: Mulliken charges:
elementType: O O N N C C C C C C C C C C C C C C C C H H H H H H H H H H H H
charge: -0.151610 -0.164176 0.017182 0.017698 0.397723 -0.729165 0.313516 0.464214 -0.371494 -0.436930 -0.369583 -0.234744 -0.390294 -0.425273 -0.247137 -0.220860 -0.233304 -0.246193 0.011994 0.052485 0.238761 0.241552 0.304022 0.239157 0.269175 0.233104 0.247642 0.241979 0.234092 0.229839 0.234318 0.232309
chargesum: 0.00000
title: Mulliken charges with hydrogens summed into heavy atoms:
elementType: O O N N C C C C C C C C C C C C C C C C
charge: -0.151610 -0.164176 0.017182 0.017698 0.397723 -0.248852 0.313516 0.464214 -0.067472 -0.197773 -0.100408 -0.001640 -0.142652 -0.183294 -0.013046 0.008979 0.001014 -0.013884 0.011994 0.052485
polarizability: 1.99926401e+02 -3.18708508e+01 1.93035408e+02 -1.40471537e+01 -2.46355160e+00 1.53023790e+02
1716.lowfreq: -8.4992 -5.0361 -2.9420 0.0005 0.0007 0.0009 20.4880 23.6755 28.9775
frequency: 20.4554 23.6160 28.9456 45.6340 58.5260 61.0732 75.4644 115.2061 149.4889 177.7179 200.3564 244.4270 259.6660 308.7862 317.2822 400.1133 406.6712 438.9025 446.8254 467.8322 506.9715 508.6059 516.2041 544.5538 564.2525 572.8419 614.2165 619.3458 624.8592 706.6439 719.7877 743.8396 755.2871 809.0789 815.1332 825.6319 856.2235 863.6608 886.0639 901.4814 915.1403 950.7228 968.3253 984.9658 989.8202 999.0445 1000.9133 1026.5788 1048.7891 1082.7696 1097.0412 1172.3010 1174.9087 1179.5538 1183.8369 1191.0425 1207.8113 1222.9507 1269.9021 1292.6725 1310.9883 1325.0789 1340.4845 1375.0293 1378.7680 1382.9499 1404.8645 1439.7379 1440.4836 1461.8374 1481.7989 1484.7544 1587.8268 1591.5223 1610.2889 1616.3369 2262.5561 2299.1216 2972.1493 2983.5817 3031.1650 3114.1709 3121.7026 3122.9906 3136.1393 3138.7759 3147.2237 3153.6524 3165.1372 3169.2965
redmass: 11.6273 10.2714 6.7805 4.3084 8.1908 4.6929 7.5116 6.4926 6.5176 5.6359 5.9439 6.3647 4.5461 3.7960 4.1941 3.3318 2.8605 4.1068 6.4770 3.2571 6.5655 7.5519 8.6789 10.0516 5.3887 11.8275 5.2915 5.0893 5.7747 2.2394 4.4861 1.5681 1.4859 3.1360 3.2180 4.0936 3.3934 1.4466 1.8089 3.1070 1.6151 1.7930 1.4201 1.4060 5.8282 1.3342 1.3158 2.2600 2.2471 1.6097 2.3878 1.1567 1.1005 1.8560 1.1345 1.1327 2.3580 2.3015 1.4728 1.5234 1.1981 1.2294 1.3365 12.6828 6.4923 6.5653 12.7334 2.1724 2.2408 1.2134 2.4200 2.0206 6.4821 6.1532 6.0414 6.4651 12.3569 12.5704 1.0825 1.0603 1.0990 1.0884 1.0875 1.0863 1.0906 1.0888 1.0957 1.0934 1.1013 1.0998
irintensity: 0.0373 0.0442 0.1610 0.2381 0.1698 0.1330 0.5763 1.2430 3.1480 2.5660 3.6246 2.3843 1.4955 2.8993 6.9089 1.3084 0.1681 2.7803 9.9512 9.8501 6.0646 10.3927 13.9008 11.7378 4.7736 29.9151 5.0156 21.6634 9.3641 33.1906 9.0647 56.5680 94.8624 15.4113 19.8841 3.2401 82.6835 13.7734 34.8911 58.5920 16.6143 1.3154 1.5608 0.0265 0.5100 0.0216 0.6298 6.6430 5.7772 12.8814 0.2500 1.7273 2.4859 1.0314 1.3133 0.5612 12.8658 15.9618 28.2287 43.2159 38.7523 45.3462 1.8800 11.8618 1.3368 3.8680 17.2242 13.4104 6.7748 19.6012 31.1881 1.8862 2.7069 0.7863 9.9518 0.8948 917.4695 991.1745 2.3235 20.7449 10.5553 8.3435 7.2908 1.8921 6.9678 8.4744 29.7675 19.6106 23.1867 20.5128
temp: 298.150 k
press: 1.00000 atm
elementType: 8 8 7 7 6 6 6 6 6 6 6 6 6 6 6 6 6 6 6 6 1 1 1 1 1 1 1 1 1 1 1 1
symmnumber: 1
zpe: 629302.6 jmol-1
zpe.correction: 0.239689 hartree
zpe.thermalcorrener: 0.257293 hartree
zpe.thermalcorrenthalpy: 0.258237 hartree
zpe.thermalcorrgfe: 0.190466 hartree
zpe.sumelectzpe: -875.463297 hartree
zpe.sumelectthermal: -875.445693 hartree
zpe.sumelectthermalent: -875.444748 hartree
zpe.sumelectthermalfe: -875.512519 hartree
dipole: -0.6542 -4.2187 -0.9524
dipole: 4.3741
quadrupole: -107.0103 -123.6434 -120.5270
quadrupole: -7.7325 3.5932 -0.3230
quadrupole: 10.0500 -6.5832 -3.4668 -7.7325 3.5932 -0.3230
hfenergy: -875.7029854 hartree
pointgroup: C01 [X(C16H12N2O2)]
dipole: -1.0444701 -1.3613753 0.1311126 debye
polarizability: 163.1635748|-21.6125573|221.8425839|-14.0151318|2.2229325|160.9794398 unknown
InChI: InChI=1S/C16H12N2O2/c19-11-17-16(18-12-20)15-9-5-4-8-14(15)10-13-6-2-1-3-7-13/h1-9,16H,10H2
charge 0 multiplicity 1
32 atoms
O  2.458105 2.49957 -3.243051
O  1.256152 3.089281 2.139204
N  1.657805 0.761931 -1.736556
N  1.491559 1.201375 0.616153
C  0.161644 -1.644917 0.76928
C  -0.811097 -0.827824 1.619904
C  1.004816 -1.068406 -0.227598
C  -1.890297 -0.059053 0.851776
C  0.944439 0.439375 -0.511487
C  0.254143 -3.040952 0.994514
C  1.89799 -1.882572 -0.957184
C  1.150335 -3.854068 0.266276
C  -2.602872 -0.67047 -0.213041
C  -2.228242 1.268573 1.221382
C  1.977714 -3.271272 -0.716992
C  -3.62592 0.028899 -0.890895
C  -3.252872 1.970612 0.545252
C  -3.954917 1.352789 -0.514744
C  2.024524 1.688009 -2.447445
C  1.307102 2.174073 1.33679
H  -0.248808 -0.114859 2.252856
H  -1.311674 -1.523322 2.32132
H  -0.116522 0.736977 -0.64085
H  -0.389816 -3.4948 1.757416
H  2.526638 -1.416734 -1.721914
H  1.198567 -4.93041 0.464442
H  -2.348552 -1.694051 -0.513064
H  -1.693984 1.753441 2.049001
H  2.676551 -3.888031 -1.291888
H  -4.16664 -0.456903 -1.711063
H  -3.498839 2.995503 0.844509
H  -4.747633 1.895239 -1.041604
