program: Gaussian 09
title: 000151580
version: EM64L-G09RevD.01
frameworkgroup: C1[X(C12H18Cl2N2)]
method: RPBEPBE
basis: SDD
operation: Freq
keyword: #p
keyword: freq=noraman
keyword: PBEPBE/SDD
title: #p freq=noraman PBEPBE/SDD
converged: YES YES NO NO
title: Mulliken charges:
elementType: Cl Cl N N C C C C C C C C C C C C H H H H H H H H H H H H H H H H H H
charge: -0.061322 -0.061279 -0.184069 -0.542014 0.442873 -0.369993 -0.368408 0.520659 -0.553925 -0.364356 -0.364719 -0.441855 -0.437411 -0.587860 -0.587781 -0.404416 0.238366 0.247425 0.246569 0.237799 0.197385 0.197359 0.229842 0.229706 0.229410 0.229429 0.293963 0.262462 0.262375 0.294581 0.220638 0.220609 0.263928 0.264024
chargesum: 0.00000
title: Mulliken charges with hydrogens summed into heavy atoms:
elementType: Cl Cl N N C C C C C C C C C C C C
charge: -0.061322 -0.061279 -0.184069 -0.014062 0.442873 0.115799 0.115960 0.520659 -0.159180 -0.134514 -0.135012 -0.212445 -0.207982 -0.031434 -0.030825 0.036831
polarizability: 2.38014814e+02 1.79682587e-02 1.84108745e+02 2.23849453e+00 -4.30710697e-01 9.98894291e+01
1716.lowfreq: -9.3393 -7.1131 -0.6541 -0.0005 0.0016 0.0030 16.7676 30.9362 36.0841
frequency: 16.5870 30.9322 36.0036 39.1555 44.0329 73.1280 87.8247 111.6402 116.6335 174.5903 202.5519 204.3398 238.3833 256.3177 266.7173 290.1345 338.0530 361.4419 386.3440 411.6940 421.2646 519.6435 521.9875 554.8692 583.1430 637.3290 666.2553 678.2343 715.9828 736.1930 761.1323 775.9002 788.6870 808.5527 812.1053 827.9717 930.6015 938.1555 950.0699 953.5672 987.8724 995.2056 998.8692 1030.3615 1039.8606 1043.0588 1076.7634 1093.7271 1119.3355 1143.5029 1174.9575 1201.9109 1222.0262 1228.4135 1250.3182 1254.8146 1265.2129 1277.5835 1278.6483 1295.0390 1327.7163 1330.2269 1345.2780 1345.4388 1348.6805 1374.9688 1384.6735 1426.0126 1452.3955 1459.1962 1460.2293 1474.4587 1478.3952 1492.6239 1513.1419 1570.4531 1629.5043 1644.0999 2970.8544 2992.4409 3004.1877 3006.8248 3022.2519 3057.5991 3060.5802 3063.3219 3065.3991 3071.5755 3114.1192 3116.5101 3145.6209 3148.6280 3152.5756 3157.1035 3459.7885 3585.8723
redmass: 4.5817 7.5593 3.0747 10.1903 4.6065 4.7106 1.8821 2.7256 2.6618 5.0054 4.1061 8.4938 2.6756 4.1892 1.1354 3.1187 5.7749 2.7622 4.2205 2.9721 3.0936 2.6792 4.1307 2.6828 1.6049 6.8062 6.7114 5.5131 3.2246 3.7606 1.1317 1.1214 1.2623 2.0201 1.2531 3.2462 1.4730 1.2895 2.7861 1.3537 4.4209 1.4376 2.9693 4.1869 1.4555 4.0427 1.2626 4.2381 1.4460 1.2891 1.6437 1.1899 2.1094 1.9744 1.1624 1.1635 1.3538 1.4434 1.4277 1.2317 1.3558 1.1535 1.5086 1.2695 1.2549 4.9344 1.5662 3.1718 1.0996 1.0953 1.0917 1.0960 1.0833 1.0876 2.7327 6.5357 6.2949 1.0941 1.0591 1.0603 1.0609 1.0628 1.1018 1.1064 1.0581 1.0566 1.1006 1.1015 1.0889 1.0887 1.1113 1.1118 1.0934 1.0940 1.0445 1.0978
irintensity: 0.4768 0.1158 0.8821 1.4488 0.0887 3.2409 3.3908 0.6890 0.2485 1.3563 1.2865 9.9230 10.2729 0.0142 48.5756 9.3750 5.3229 0.1158 8.6561 0.0348 8.9223 8.7500 22.7981 48.4388 365.0512 2.0785 56.0554 90.7457 17.3894 5.7080 1.2978 4.9462 8.3311 41.4505 0.0836 18.3163 7.9116 0.0713 18.1033 0.0313 52.6029 4.4568 1.7450 0.0093 1.4941 1.5365 0.2591 45.1496 38.4213 6.8145 51.6514 1.4740 35.8660 2.2846 11.9143 11.7324 0.5086 33.7438 16.2572 8.8106 4.8994 1.3349 87.0284 2.3816 0.7369 3.0074 29.6585 3.8009 5.5759 3.0710 16.7185 9.2557 10.9212 27.8410 277.7088 4.1506 83.1094 43.3425 42.0967 54.9987 14.4983 42.2629 4.1450 44.8325 9.9703 26.5071 8.1103 18.8772 11.3573 32.6363 2.0266 25.1874 35.4252 6.9359 1.9087 0.4454
temp: 298.150 k
press: 1.00000 atm
elementType: 17 17 7 7 6 6 6 6 6 6 6 6 6 6 6 6 1 1 1 1 1 1 1 1 1 1 1 1 1 1 1 1 1 1
symmnumber: 1
zpe: 738684.3 jmol-1
zpe.correction: 0.281350 hartree
zpe.thermalcorrener: 0.299316 hartree
zpe.thermalcorrenthalpy: 0.300260 hartree
zpe.thermalcorrgfe: 0.231185 hartree
zpe.sumelectzpe: -1496.452904 hartree
zpe.sumelectthermal: -1496.434938 hartree
zpe.sumelectthermalent: -1496.433994 hartree
zpe.sumelectthermalfe: -1496.503069 hartree
dipole: 1.3670 -0.0511 -1.4505
dipole: 1.9938
quadrupole: -110.4962 -122.0972 -117.7455
quadrupole: -0.4516 -6.2775 -0.3111
quadrupole: 6.2834 -5.3176 -0.9658 -0.4516 -6.2775 -0.3111
hfenergy: -1496.7342538 hartree
pointgroup: C01 [X(C12H18Cl2N2)]
dipole: -0.5240721 0.0281377 -0.5829987 debye
polarizability: 238.0408291|-0.3930108|184.1009532|1.0181404|1.0334522|99.8712064 unknown
InChI: InChI=1S/C12H18Cl2N2/c13-6-9-16(10-7-14)12-3-1-11(2-4-12)5-8-15/h1-4H,5-10,15H2
charge 0 multiplicity 1
34 atoms
Cl 3.736536 3.494622 0.722433
Cl 3.624465 -3.60214 0.662444
N  1.907327 -0.015223 -0.555997
N  -5.942485 0.02364 1.099087
C  0.487839 0.005429 -0.531669
C  2.678777 1.237356 -0.572189
C  2.641904 -1.289422 -0.592714
C  -2.406683 0.048095 -0.548423
C  -3.923808 0.068127 -0.493486
C  -0.237732 1.234876 -0.503835
C  -0.273667 -1.202442 -0.550284
C  -1.646654 1.244097 -0.51642
C  -1.682001 -1.170195 -0.56261
C  2.848209 1.826984 0.842623
C  2.774431 -1.916866 0.80978
C  -4.476473 0.008688 0.973566
H  3.676613 1.041765 -1.002403
H  2.193072 1.984225 -1.226557
H  2.144909 -2.00676 -1.271412
H  3.650971 -1.11252 -1.004243
H  -4.317221 0.987334 -0.971406
H  -4.344412 -0.791275 -1.052969
H  0.286263 2.195287 -0.48269
H  0.222196 -2.177711 -0.567777
H  -2.166324 2.210738 -0.505162
H  -2.22947 -2.121087 -0.589492
H  1.884475 2.034826 1.32933
H  3.480963 1.200488 1.488572
H  3.411226 -1.321089 1.480346
H  1.798446 -2.11343 1.276346
H  -4.066377 0.863183 1.544619
H  -4.091588 -0.905848 1.463425
H  -6.411739 -0.801159 0.713055
H  -6.387688 0.894307 0.793712
