program: Gaussian 09
title: 000151575
version: EM64L-G09RevD.01
frameworkgroup: C1[X(C15H15N3O2)]
method: RPBEPBE
basis: SDD
operation: Freq
keyword: #p
keyword: freq=noraman
keyword: PBEPBE/SDD
title: #p freq=noraman PBEPBE/SDD
converged: YES YES NO NO
title: Mulliken charges:
elementType: O O N N N C C C C C C C C C C C C C C C H H H H H H H H H H H H H H H
charge: -0.308829 -0.291623 -0.028709 -0.363183 0.064784 -0.575713 0.487054 -0.422497 -0.346939 -0.375093 0.225721 0.279161 -0.241421 -0.226000 -0.234906 -0.352181 -0.348383 -0.220483 -0.236463 -0.224998 0.228756 0.243902 0.258992 0.279183 0.338208 0.260830 0.244468 0.233580 0.227339 0.229914 0.273213 0.223010 0.232987 0.232615 0.233701
chargesum: 0.00000
title: Mulliken charges with hydrogens summed into heavy atoms:
elementType: O O N N N C C C C C C C C C C C C C C C
charge: -0.308829 -0.291623 -0.028709 -0.024975 0.064784 -0.103055 0.487054 0.115678 -0.086110 -0.130625 0.225721 0.279161 -0.007841 0.001339 -0.004991 -0.078968 -0.125372 0.012504 -0.003847 0.008703
polarizability: 1.93561522e+02 -3.50115605e+01 1.73992178e+02 3.47650480e+00 -9.24726013e+00 1.74920974e+02
1716.lowfreq: -5.5131 -0.0005 0.0005 0.0006 1.1988 12.4341 14.7494 25.8019 34.0155
frequency: 14.1028 25.6314 33.8982 41.5186 50.3880 67.3810 83.8488 130.6224 156.6411 189.4434 234.3102 269.9094 297.6501 313.1914 336.4405 369.5693 392.9347 401.5675 402.2547 413.6148 466.6421 479.5251 532.9041 580.8176 614.0305 617.0216 641.3115 650.1460 669.4993 688.5464 702.6814 704.9344 765.8104 792.6092 800.0910 811.4988 841.2985 854.0604 856.8191 909.6243 931.2365 937.9230 976.3568 978.8791 986.1353 989.7816 990.4285 999.3510 1006.4284 1014.0029 1027.7952 1037.6186 1063.4114 1086.3400 1102.0733 1148.0303 1164.6626 1173.9973 1174.2887 1193.0393 1194.7788 1210.6018 1248.9871 1284.0256 1316.1899 1319.5743 1326.3484 1341.0930 1344.0430 1382.4479 1385.9366 1387.7582 1429.4651 1435.1148 1443.9452 1456.8297 1467.7401 1485.9863 1496.2148 1567.7707 1595.9823 1603.8300 1611.7560 1613.0812 3023.5382 3029.0696 3086.4582 3115.2846 3122.6286 3124.7296 3129.6012 3133.4782 3138.8620 3146.8648 3150.8915 3159.6902 3166.2065 3170.5959 3566.7214
redmass: 5.6961 4.2988 3.9944 5.5267 5.6226 6.4588 7.6181 5.0620 6.0336 5.7542 6.0218 5.5667 4.9413 4.7217 6.3685 3.2038 1.8241 2.8579 2.7964 5.2908 3.9327 4.3025 3.5292 4.8402 6.2689 6.2410 1.5205 3.3263 5.1697 4.2239 1.5246 1.6505 2.2264 2.7223 3.6086 3.7404 4.5355 1.2505 1.2548 2.1628 1.4955 1.4389 3.1278 1.4279 1.5067 4.4928 4.5447 1.4024 1.3410 4.0739 2.2493 2.3950 2.1744 1.5922 1.6766 2.8735 2.6946 1.0601 1.0542 1.1660 1.1539 2.6778 2.0290 2.4968 1.8621 1.3781 1.6311 1.2990 1.4735 1.9606 8.9284 2.2770 1.3096 1.7019 2.1310 1.1530 1.8534 2.1760 2.1944 6.6741 6.0300 6.5574 6.0222 5.9992 1.0588 1.0615 1.1048 1.1016 1.0859 1.0864 1.0875 1.0876 1.0923 1.0922 1.0964 1.0959 1.1015 1.1008 1.0775
irintensity: 0.7491 0.4807 0.8711 2.5754 1.9398 1.6116 13.3139 1.8613 6.7333 1.3076 2.0698 6.9382 2.7355 0.7093 0.6823 14.0098 4.1148 0.4170 0.2603 1.9172 7.3572 0.9422 16.7338 20.4255 1.4671 0.3824 114.0555 8.2813 20.9223 4.2358 149.0914 46.9614 25.3042 25.3613 2.1218 0.9924 37.4313 2.2891 0.6040 26.3189 11.8928 3.5339 54.3199 1.7293 1.6694 2.2387 0.1079 0.6161 1.5992 22.5248 3.3050 17.3184 74.9320 11.4977 10.4200 10.8170 73.5355 1.3215 0.2173 0.1419 3.1241 8.8515 88.9585 103.6010 69.5534 7.8977 20.6751 6.0666 14.0006 2.9433 1.8284 3.7849 23.4741 20.3408 9.8996 11.5872 172.2428 8.7836 145.1518 100.2110 1.1637 43.0589 7.4060 1.9247 21.3763 30.6903 5.6968 4.7542 1.9237 5.6211 0.3719 2.9426 12.7146 20.1037 26.7367 15.2132 18.0326 19.5179 24.7298
temp: 298.150 k
press: 1.00000 atm
elementType: 8 8 7 7 7 6 6 6 6 6 6 6 6 6 6 6 6 6 6 6 1 1 1 1 1 1 1 1 1 1 1 1 1 1 1
symmnumber: 1
zpe: 720156.1 jmol-1
zpe.correction: 0.274293 hartree
zpe.thermalcorrener: 0.291972 hartree
zpe.thermalcorrenthalpy: 0.292916 hartree
zpe.thermalcorrgfe: 0.225034 hartree
zpe.sumelectzpe: -893.821191 hartree
zpe.sumelectthermal: -893.803512 hartree
zpe.sumelectthermalent: -893.802568 hartree
zpe.sumelectthermalfe: -893.870450 hartree
dipole: -1.2298 1.4638 -0.1598
dipole: 1.9185
quadrupole: -103.5379 -117.8566 -116.5266
quadrupole: -1.2941 -8.3674 9.1097
quadrupole: 9.1025 -5.2162 -3.8862 -1.2941 -8.3674 9.1097
hfenergy: -894.095484 hartree
pointgroup: C01 [X(C15H15N3O2)]
dipole: 0.3549751 -0.6453387 -0.1650514 debye
polarizability: 178.7001712|-35.4491672|188.1441473|-11.3746453|4.090071|175.6303564 unknown
InChI: InChI=1S/C15H15N3O2/c19-15(14-9-5-2-6-10-14)16-12-18(17-20)11-13-7-3-1-4-8-13/h1-10,16H,11-12H2
charge 0 multiplicity 1
35 atoms
O  1.352426 0.531235 -1.705155
O  -1.171174 2.79693 2.138603
N  -1.561374 2.17761 0.024091
N  0.793373 1.50282 0.329167
N  -2.064708 2.407042 1.284765
C  -2.513557 1.591104 -0.957987
C  -2.529135 0.064694 -0.967531
C  -0.12931 2.45495 -0.272386
C  -1.704306 -0.669718 -1.855179
C  -3.380763 -0.633189 -0.073558
C  1.466608 0.557055 -0.436715
C  2.34815 -0.408487 0.307233
C  -1.734197 -2.082745 -1.850859
C  -3.412346 -2.045013 -0.070689
C  -2.589318 -2.773493 -0.961909
C  3.340311 -1.095014 -0.438873
C  2.213866 -0.674721 1.695744
C  4.200107 -2.015262 0.194687
C  3.072323 -1.600232 2.32779
C  4.071179 -2.267596 1.581311
H  -2.246943 1.989071 -1.952472
H  -3.508015 1.981802 -0.680768
H  0.007923 2.413973 -1.363672
H  0.083433 3.4668 0.114791
H  0.927569 1.571216 1.338737
H  -1.020029 -0.144857 -2.532135
H  -4.014766 -0.069042 0.621349
H  -1.087649 -2.63993 -2.537352
H  -4.076547 -2.57514 0.62107
H  -2.61363 -3.86905 -0.961452
H  3.412141 -0.891045 -1.512147
H  1.422309 -0.200961 2.288688
H  4.967593 -2.535948 -0.388196
H  2.956434 -1.80692 3.397164
H  4.737122 -2.984241 2.074643
