program: Gaussian 09
title: 000151574
version: EM64L-G09RevD.01
frameworkgroup: C1[X(C10H13N3O2)]
method: RPBEPBE
basis: SDD
operation: Freq
keyword: #p
keyword: freq=noraman
keyword: PBEPBE/SDD
title: #p freq=noraman PBEPBE/SDD
converged: YES YES NO NO
title: Mulliken charges:
elementType: O O N N N C C C C C C C C C C H H H H H H H H H H H H H
charge: -0.303755 -0.298366 -0.029155 -0.360697 0.052812 -0.435848 -0.336752 0.278681 0.202906 -0.654406 -0.349196 -0.347169 -0.219855 -0.238190 -0.224393 0.280156 0.265271 0.220478 0.241935 0.342277 0.224027 0.274440 0.217059 0.274635 0.222086 0.233662 0.233216 0.234145
chargesum: 0.00000
title: Mulliken charges with hydrogens summed into heavy atoms:
elementType: O O N N N C C C C C C C C C C
charge: -0.303755 -0.298366 -0.029155 -0.018420 0.052812 0.109579 0.125661 0.278681 0.202906 0.061120 -0.074562 -0.125084 0.013807 -0.004975 0.009752
polarizability: 1.79427029e+02 -1.34302641e+00 1.46088987e+02 -8.46064290e+00 9.49718214e+00 8.33976687e+01
1716.lowfreq: -11.5447 -10.9832 -0.0003 -0.0001 0.0004 0.8968 24.3264 38.3443 40.7985
frequency: 24.1398 38.2518 40.7299 75.0389 88.0420 119.7447 154.8696 179.1297 225.6790 254.5030 302.3984 336.2702 345.9138 357.5656 397.4363 402.9681 425.5140 479.0204 541.7976 613.6072 617.2977 646.3947 660.9282 689.0467 702.5862 783.8566 794.1700 797.6764 833.9905 855.5568 937.2396 948.0459 986.3665 988.1585 990.2249 1007.1497 1009.2062 1029.6442 1045.0309 1085.3923 1089.3608 1142.1986 1174.1202 1180.0852 1192.7503 1199.7809 1260.9722 1291.4286 1317.6233 1319.8655 1330.1190 1346.1316 1385.5385 1387.1522 1400.3340 1426.6988 1434.2708 1460.4414 1467.3822 1474.1887 1493.9270 1495.8609 1567.0328 1603.2230 1611.4559 2987.5038 2998.8384 3029.9861 3071.5781 3089.0289 3100.2664 3116.2715 3121.0836 3133.4878 3146.7972 3159.5852 3170.8148 3564.2383
redmass: 3.8949 4.3607 5.7994 3.0856 5.2178 4.3712 4.6177 5.1981 1.3170 3.7514 4.6593 3.9786 2.9476 3.1883 3.4478 3.1686 4.1910 4.5612 3.2170 6.0528 3.7635 1.4404 5.3651 4.0751 1.5151 1.7017 2.1223 2.1640 5.2889 1.2519 1.4422 2.3133 1.4492 4.0723 3.8323 1.3961 3.2153 2.1765 2.6780 1.6708 1.8418 2.7401 1.0629 2.1974 1.3084 2.0167 2.0620 2.7780 1.5986 1.5402 1.3419 1.4985 7.5909 1.2817 1.1961 1.2321 1.8773 1.1520 1.7365 1.0451 1.1581 1.8615 6.6045 6.5707 6.0319 1.0354 1.0635 1.0613 1.0996 1.0992 1.1025 1.1022 1.0877 1.0871 1.0920 1.0958 1.1009 1.0774
irintensity: 0.7475 2.4659 4.2029 5.8846 8.7145 0.7010 6.3875 2.4358 0.4958 3.3676 4.5657 2.6156 4.6998 15.5661 1.2117 0.3405 4.5850 0.4780 35.9390 1.4703 5.0852 88.7365 7.2001 1.0359 113.1587 8.8934 14.8724 31.5958 31.6395 0.4739 3.4032 2.7833 1.2849 16.1654 38.8420 7.4077 66.0120 11.4100 4.2461 19.7681 8.8280 22.8050 0.4190 74.8865 23.8640 33.6378 68.9848 123.0931 18.9909 23.4126 39.0283 2.0352 2.3485 2.0213 12.7156 30.7495 13.8285 10.3906 186.5028 19.5512 26.4931 161.9566 104.6910 46.7015 7.2013 21.9239 34.2065 23.4941 3.9575 29.8725 19.5633 3.1173 7.9662 1.8620 18.7947 14.6292 20.5918 27.4354
temp: 298.150 k
press: 1.00000 atm
elementType: 8 8 7 7 7 6 6 6 6 6 6 6 6 6 6 1 1 1 1 1 1 1 1 1 1 1 1 1
symmnumber: 1
zpe: 583490.6 jmol-1
zpe.correction: 0.222240 hartree
zpe.thermalcorrener: 0.236796 hartree
zpe.thermalcorrenthalpy: 0.237740 hartree
zpe.thermalcorrgfe: 0.178646 hartree
zpe.sumelectzpe: -702.404038 hartree
zpe.sumelectthermal: -702.389482 hartree
zpe.sumelectthermalent: -702.388538 hartree
zpe.sumelectthermalfe: -702.447632 hartree
dipole: -1.0042 -0.9516 -0.0581
dipole: 1.3847
quadrupole: -73.3135 -96.7291 -88.2871
quadrupole: -13.2342 -4.0229 -1.3323
quadrupole: 12.7964 -10.6192 -2.1772 -13.2342 -4.0229 -1.3323
hfenergy: -702.6262776 hartree
pointgroup: C01 [X(C10H13N3O2)]
dipole: 0.4147791 -0.0226511 -0.3524761 debye
polarizability: 178.1737942|12.7781214|85.7807509|1.8513135|13.5569446|144.9591397 unknown
InChI: InChI=1S/C10H13N3O2/c1-2-13(12-15)8-11-10(14)9-6-4-3-5-7-9/h3-7,11H,2,8H2,1H3
charge 0 multiplicity 1
28 atoms
O  0.088773 -0.546939 -1.761967
O  -2.683427 0.110357 2.36575
N  -3.012438 0.055934 0.152782
N  -0.65358 -0.594623 0.438053
N  -3.354101 0.600993 1.368309
C  -1.995624 -1.031967 0.081598
C  -3.684353 0.612467 -1.042689
C  1.645922 0.158361 -0.028528
C  0.316937 -0.343621 -0.524728
C  -2.745756 1.463986 -1.922114
C  2.751784 0.052954 -0.910794
C  1.831093 0.745022 1.251796
C  4.026899 0.504638 -0.513785
C  3.107482 1.202167 1.645568
C  4.209125 1.077555 0.7674
H  -2.316957 -1.822707 0.781869
H  -1.973199 -1.407243 -0.952822
H  -4.104365 -0.226937 -1.629169
H  -4.524805 1.216964 -0.660177
H  -0.476052 -0.449793 1.432844
H  -2.383875 2.345524 -1.364659
H  -1.871374 0.882589 -2.263423
H  -3.297081 1.817685 -2.812112
H  2.581688 -0.382015 -1.90102
H  0.987816 0.885654 1.938984
H  4.876251 0.413254 -1.199413
H  3.240528 1.661162 2.631125
H  5.198992 1.431279 1.076324
