program: Gaussian 09
title: 000151570
version: EM64L-G09RevD.01
frameworkgroup: C1[X(C15H13N3O4)]
method: RPBEPBE
basis: SDD
operation: Freq
keyword: #p
keyword: freq=noraman
keyword: PBEPBE/SDD
title: #p freq=noraman PBEPBE/SDD
converged: YES YES NO NO
title: Mulliken charges:
elementType: O O O O N N N C C C C C C C C C C C C C C C H H H H H H H H H H H H H
charge: -0.225907 -0.196210 -0.222097 -0.198787 -0.407128 0.077837 0.048308 0.319633 0.139248 -0.400586 -0.373256 -0.788289 -0.217661 -0.245852 0.151988 0.409762 -0.359085 0.271452 -0.303587 -0.337774 -0.150036 -0.275287 0.238713 0.247630 0.214613 0.234780 0.269737 0.234618 0.235605 0.268526 0.294406 0.238906 0.300755 0.294979 0.210046
chargesum: 0.00000
title: Mulliken charges with hydrogens summed into heavy atoms:
elementType: O O O O N N N C C C C C C C C C C C C C C C
charge: -0.225907 -0.196210 -0.222097 -0.198787 -0.106374 0.077837 0.048308 0.319633 0.139248 -0.161873 -0.125626 -0.069159 0.016957 -0.010247 0.151988 0.409762 -0.090559 0.271452 -0.009181 -0.098868 0.144943 -0.065241
polarizability: 6.03879035e+02 2.90385579e-01 2.13922357e+02 2.91041378e-01 -2.72189509e+00 1.00007949e+02
1716.lowfreq: -2.7765 -0.0008 -0.0004 0.0007 2.4391 2.6859 17.1332 25.5882 28.2238
frequency: 17.1026 25.5744 28.2046 48.4794 60.6410 74.2550 104.9258 123.0608 129.1907 152.7044 155.1523 171.7479 194.5271 219.6248 228.4230 240.0272 275.8691 350.7347 364.2063 373.6982 390.2930 399.2483 414.1612 453.1485 466.9452 504.0523 518.7785 550.7568 561.3976 599.0453 654.0022 659.6078 666.7494 676.8434 692.2257 722.3071 743.2360 763.6823 783.6781 789.5846 802.0244 864.5003 872.4850 879.9572 903.9988 908.3714 924.3804 925.9227 954.7965 989.4628 992.7748 994.7972 1006.7250 1025.7309 1047.1104 1050.8226 1103.6265 1125.8049 1135.1636 1173.2930 1178.8923 1203.1279 1213.6337 1223.7749 1235.1167 1246.4239 1275.4058 1284.1876 1296.9779 1318.0962 1342.0958 1371.1184 1374.5538 1405.9319 1424.9769 1456.2676 1465.2143 1472.7297 1475.3907 1485.0620 1523.1459 1570.9004 1578.8602 1606.2268 1629.2530 1630.5138 2970.1126 2992.9323 3077.6779 3094.7373 3120.4692 3125.2807 3129.5353 3145.7237 3152.8010 3165.6757 3228.1459 3259.1930 3365.5716
redmass: 6.7396 7.6627 4.9770 7.9719 7.6586 8.1397 4.1312 1.3144 3.3770 3.0695 6.5383 5.3618 4.3626 4.8996 3.7445 5.0852 5.5015 3.3130 4.3243 4.8431 5.4677 6.8529 3.7072 5.1843 3.6066 5.0102 5.1028 5.3297 5.4170 4.2113 2.7048 3.3891 1.7783 8.2077 5.6704 10.1660 1.6794 6.1314 2.3290 4.5891 1.3003 1.6257 6.1063 1.3000 1.3871 9.5611 6.0870 1.6853 1.3966 1.1100 1.5657 1.3477 5.1783 1.2632 1.6079 2.1610 4.3211 2.8242 2.3120 2.1108 1.0647 2.9229 2.6458 2.9679 2.6589 1.3536 2.0880 1.4618 3.6872 1.6275 8.0236 6.6231 3.6485 1.2357 1.8902 1.0808 5.4547 1.3312 1.9737 1.9734 6.5812 5.1014 6.2210 5.9675 7.7989 5.7163 1.0878 1.0368 1.0965 1.1008 1.0871 1.0918 1.0882 1.0936 1.0905 1.1008 1.0961 1.1030 1.0752
irintensity: 0.0562 0.1683 1.7336 1.5120 0.6696 0.8037 8.8716 1.4388 4.1983 5.6827 2.2415 1.3909 1.3893 6.0795 4.8418 6.1350 0.5302 6.6744 2.0906 1.0857 5.6667 2.9482 5.7831 2.3630 4.6757 1.3944 0.0554 1.4704 0.8906 0.4511 46.9243 20.1532 61.3088 6.2225 13.6147 14.6275 44.0465 2.0955 20.4276 12.6165 54.9863 13.7399 47.8058 0.8068 3.3329 12.2620 0.2353 12.5546 3.6551 87.1794 2.2951 0.5740 80.1077 30.3240 14.6374 3.8986 657.7928 126.8446 135.7855 83.3192 2.5659 218.9142 87.8043 809.7867 80.0677 11.1785 17.7647 11.7504 108.7750 19.4235 72.4894 4.6455 38.0312 23.7120 22.3864 18.8667 271.2074 23.6566 442.6639 359.2905 23.8584 5.4713 10.1779 15.0499 133.0647 95.4722 65.1678 18.6543 15.0801 32.5592 17.3341 8.7855 3.1273 30.7658 5.7752 32.3013 1.0503 4.9202 0.0600
temp: 298.150 k
press: 1.00000 atm
elementType: 8 8 8 8 7 7 7 6 6 6 6 6 6 6 6 6 6 6 6 6 6 6 1 1 1 1 1 1 1 1 1 1 1 1 1
symmnumber: 1
zpe: 670778.3 jmol-1
zpe.correction: 0.255486 hartree
zpe.thermalcorrener: 0.275564 hartree
zpe.thermalcorrenthalpy: 0.276508 hartree
zpe.thermalcorrgfe: 0.203508 hartree
zpe.sumelectzpe: -1042.838788 hartree
zpe.sumelectthermal: -1042.818711 hartree
zpe.sumelectthermalent: -1042.817766 hartree
zpe.sumelectthermalfe: -1042.890767 hartree
dipole: -6.0735 -9.5754 2.6652
dipole: 11.6482
quadrupole: -132.6287 -124.7994 -128.3677
quadrupole: -21.6254 4.5267 4.2474
quadrupole: -4.0301 3.7992 0.2309 -21.6254 4.5267 4.2474
hfenergy: -1043.0942742 hartree
pointgroup: C01 [X(C15H13N3O4)]
dipole: -2.4203754 3.7132499 1.1640997 debye
polarizability: 603.6425326|-0.9420436|181.2989909|10.5604799|51.5611231|132.8678175 unknown
InChI: InChI=1S/C15H13N3O4/c1-11-5-2-3-7-13(11)15(19)17-16-10-4-6-12-8-9-14(22-12)18(20)21/h2-10,17H,1H3
charge 0 multiplicity 1
35 atoms
O  4.371509 -0.026941 -0.061898
O  -2.80425 -1.768499 -0.957244
O  7.793252 -1.059392 -0.363931
O  5.836565 -2.213291 -0.752008
N  -2.07702 0.271325 -0.044108
N  -0.748384 -0.052888 -0.133651
N  6.495112 -1.155358 -0.40541
C  -5.53537 -0.441418 -1.084025
C  -4.477209 -0.16556 -0.160425
C  -6.833813 0.026751 -0.759906
C  -4.749857 0.531798 1.048955
C  -5.311875 -1.201773 -2.377773
C  -7.098837 0.725814 0.438721
C  -6.052713 0.975422 1.354569
C  -3.082788 -0.661722 -0.432757
C  3.931143 1.254222 0.348541
C  5.054753 2.058525 0.62153
C  5.770029 0.020796 -0.031847
C  6.222599 1.273069 0.379004
C  2.520871 1.510238 0.41452
C  1.538191 0.590297 0.104645
C  0.131158 0.891827 0.181318
H  -7.651823 -0.166016 -1.463502
H  -3.948269 0.683003 1.782378
H  -6.211851 -1.158495 -3.014465
H  -4.45673 -0.801876 -2.951469
H  -5.068585 -2.258935 -2.174205
H  -8.116688 1.066062 0.658825
H  -6.250753 1.496447 2.29709
H  5.023005 3.093306 0.956629
H  7.264764 1.56225 0.483466
H  2.24729 2.522711 0.737594
H  -2.379131 1.215428 0.24611
H  1.808726 -0.421841 -0.218332
H  -0.173122 1.909713 0.502064
