program: Gaussian 09
title: 000151568
version: EM64L-G09RevD.01
frameworkgroup: C1[X(C14H16N2O4)]
method: RPBEPBE
basis: SDD
operation: Freq
keyword: #p
keyword: freq=noraman
keyword: PBEPBE/SDD
title: #p freq=noraman PBEPBE/SDD
converged: YES YES NO NO
title: Mulliken charges:
elementType: O O O O N N C C C C C C C C C C C C C C H H H H H H H H H H H H H H H H
charge: -0.264708 -0.288025 -0.279262 -0.446407 -0.185398 -0.002158 -0.114570 -0.497702 -0.049672 -0.490144 0.174352 -0.313665 0.196854 0.119946 -0.502306 -0.498478 -0.524023 0.205889 0.222878 -0.518775 0.282631 0.226800 0.255990 0.273695 0.255706 0.227726 0.237239 0.295291 0.219266 0.225135 0.228637 0.249551 0.365962 0.232764 0.262590 0.216393
chargesum: 0.00000
title: Mulliken charges with hydrogens summed into heavy atoms:
elementType: O O O O N N C C C C C C C C C C C C C C
charge: -0.264708 -0.288025 -0.279262 -0.080446 -0.185398 -0.002158 0.168061 -0.014912 0.224023 -0.006713 0.174352 -0.076426 0.196854 0.119946 -0.207016 0.174561 -0.274473 0.205889 0.222878 0.192973
polarizability: 2.74966145e+02 1.72189163e+01 1.88440122e+02 -5.56758190e+00 1.90493451e+00 1.06093241e+02
1716.lowfreq: -8.0237 -4.5302 -0.0008 -0.0007 -0.0006 7.8970 38.7307 45.2595 58.6458
frequency: 38.6502 45.1425 58.6280 68.9835 99.3426 118.2942 136.5359 157.8834 171.6595 186.4805 188.7605 224.5654 229.7588 262.6474 277.0630 286.2179 338.6940 345.7169 353.6834 361.3863 379.0342 414.9911 438.3252 455.9094 477.0012 517.7468 533.6805 597.1747 612.7416 643.5798 673.9771 686.7240 709.0988 720.0080 732.3304 750.7634 786.1356 820.1239 849.9652 859.5242 877.3069 904.8097 917.2922 918.2834 946.1646 963.6762 989.7105 1025.7697 1057.2647 1065.3684 1088.6911 1108.0450 1111.8899 1115.0804 1130.2701 1145.0403 1153.7813 1157.9179 1173.1740 1194.7544 1201.6606 1256.1480 1260.0409 1272.6232 1286.2166 1293.2644 1313.1724 1316.2644 1332.1494 1339.4629 1364.7177 1388.3999 1401.5505 1435.8288 1436.7603 1449.4542 1454.3297 1456.6977 1469.6977 1472.6324 1477.6933 1486.9293 1545.0987 1564.5175 1603.0107 1627.1817 2971.9541 2979.4738 2981.8522 3018.5225 3028.1321 3033.7596 3064.0679 3074.1530 3092.1761 3093.3792 3108.6997 3115.4654 3131.2213 3133.2640 3174.8880 3577.6451
redmass: 4.3582 3.3240 2.6361 4.3497 3.7596 2.0381 2.5026 3.1271 2.6775 1.9444 2.6402 4.2404 3.7734 4.3120 4.3035 3.9671 4.3738 3.9043 2.5744 2.3976 2.2073 3.1432 4.6669 3.7283 5.1026 6.0375 6.0095 5.2409 7.1384 3.2909 4.0402 5.2917 5.8191 3.9589 4.8816 5.0562 3.2979 3.4897 1.9747 2.2563 2.6594 2.0237 2.3552 1.7683 4.8367 2.0897 2.0807 5.6348 2.3076 2.6918 2.3372 2.0394 1.2659 1.3904 2.4271 1.5129 1.6847 1.5801 1.4850 1.6693 1.8984 1.5688 1.4598 1.9419 2.0817 1.4528 1.6587 1.5106 3.1560 1.2964 1.4790 6.8820 3.5194 1.1186 1.3006 1.0776 1.0907 1.0690 1.0925 1.0738 1.0806 3.5276 8.1515 7.2763 8.3780 9.5410 1.0302 1.0833 1.0341 1.0727 1.0649 1.0760 1.1032 1.0905 1.0981 1.1031 1.1034 1.1017 1.0915 1.1050 1.0915 1.0660
irintensity: 2.9365 3.6290 4.4492 2.1262 4.9482 2.2066 3.9484 2.1043 0.7277 2.5391 3.0920 3.2141 1.7728 5.8226 0.6574 1.7175 4.4528 26.9424 10.5816 53.4389 77.9790 4.8672 1.8060 9.1652 8.2638 0.6227 31.2369 5.0729 10.0723 2.2972 10.0570 3.9489 16.2818 1.8562 18.1397 15.6427 42.9964 22.1418 5.8952 23.3416 18.7931 20.7056 10.2723 16.7707 56.4851 14.5175 17.5135 126.7157 8.7566 34.9195 13.7153 185.6587 23.6098 33.2683 2.7976 21.0190 1.0504 6.2565 31.9111 57.8210 75.1600 165.6735 26.3966 1.8344 69.4466 21.8804 13.9776 51.7981 165.9851 69.1845 5.0044 75.2652 46.1943 24.3280 13.5143 10.0412 12.2335 19.3432 16.9288 22.5437 46.8347 65.0891 252.0083 96.1692 39.4424 3.2833 41.3779 14.4586 94.6761 1.0341 46.9234 31.6638 43.6578 20.2184 35.2188 15.7900 41.1589 25.6953 7.3989 15.0874 3.8195 52.5025
temp: 298.150 k
press: 1.00000 atm
elementType: 8 8 8 8 7 7 6 6 6 6 6 6 6 6 6 6 6 6 6 6 1 1 1 1 1 1 1 1 1 1 1 1 1 1 1 1
symmnumber: 1
zpe: 740113.9 jmol-1
zpe.correction: 0.281894 hartree
zpe.thermalcorrener: 0.300438 hartree
zpe.thermalcorrenthalpy: 0.301382 hartree
zpe.thermalcorrgfe: 0.235257 hartree
zpe.sumelectzpe: -951.969960 hartree
zpe.sumelectthermal: -951.951417 hartree
zpe.sumelectthermalent: -951.950473 hartree
zpe.sumelectthermalfe: -952.016598 hartree
dipole: 0.6094 -3.6493 -1.0144
dipole: 3.8364
quadrupole: -96.8447 -111.7885 -121.1254
quadrupole: -0.7610 1.9023 1.5267
quadrupole: 13.0748 -1.8690 -11.2059 -0.7610 1.9023 1.5267
hfenergy: -952.2518547 hartree
pointgroup: C01 [X(C14H16N2O4)]
dipole: 0.4097747 1.3875572 0.4299628 debye
polarizability: 270.2634294|-26.3585951|193.132893|0.2367437|4.6843978|106.1031856 unknown
InChI: InChI=1S/C14H16N2O4/c1-19-12-5-9-10(6-11(12)17)15-7-8-3-4-13(20-2)16(8)14(9)18/h5-8,13,17H,3-4H2,1-2H3
charge 0 multiplicity 1
36 atoms
O  -4.142153 -1.060728 0.666082
O  -1.292667 -1.718228 -1.220558
O  3.468868 -2.089477 0.271777
O  4.453747 0.631495 0.410594
N  -2.130261 0.138202 -0.104989
N  0.00646 2.335829 -0.529842
C  -1.993067 1.40432 0.678542
C  -3.46382 1.812009 0.955161
C  -3.552483 -0.202805 -0.362227
C  -4.25337 1.157387 -0.209558
C  -1.074977 -0.632113 -0.588608
C  -1.238228 2.437709 -0.158171
C  0.331305 -0.178177 -0.291589
C  0.791423 1.180633 -0.256728
C  1.28977 -1.216143 -0.172343
C  -3.625296 -2.438302 0.698855
C  2.176645 1.429306 -0.067089
C  2.655124 -0.97116 0.060053
C  3.096392 0.387726 0.138035
C  4.784906 -2.147975 -0.402494
H  -1.42412 1.212296 1.610654
H  -3.579013 2.908658 1.000035
H  -3.802763 1.384477 1.912869
H  -3.629585 -0.687357 -1.35358
H  -5.321803 1.022485 0.015515
H  -4.149518 1.738897 -1.143297
H  -1.782143 3.342965 -0.469789
H  0.957993 -2.253326 -0.27161
H  -4.308985 -2.99295 1.361318
H  -2.597228 -2.471214 1.104958
H  -3.614037 -2.885741 -0.312414
H  2.506528 2.475338 -0.083883
H  4.626851 1.60421 0.465993
H  5.185831 -3.138211 -0.139368
H  5.451177 -1.347141 -0.045668
H  4.655799 -2.073993 -1.499132
