program: Gaussian 09
title: 000151557
version: EM64L-G09RevD.01
frameworkgroup: C1[X(C12H6N4O4)]
method: RPBEPBE
basis: SDD
operation: Freq
keyword: #p
keyword: freq=noraman
keyword: PBEPBE/SDD
title: #p freq=noraman PBEPBE/SDD
converged: NO YES NO YES
title: Mulliken charges:
elementType: O O O O N N N N C C C C C C C C C C C C H H H H H H
charge: -0.217947 -0.132524 -0.217947 -0.132520 0.131674 -0.003956 0.018287 0.018289 -0.048266 -0.048263 0.073900 0.073902 0.299395 0.299386 -0.334010 -0.334010 -0.359431 -0.359427 -0.196177 -0.196177 0.277893 0.277893 0.301589 0.301590 0.253428 0.253427
chargesum: 0.00000
title: Mulliken charges with hydrogens summed into heavy atoms:
elementType: O O O O N N N N C C C C C C C C C C C C
charge: -0.217947 -0.132524 -0.217947 -0.132520 0.131674 -0.003956 0.018287 0.018289 -0.048266 -0.048263 0.073900 0.073902 0.299395 0.299386 -0.056117 -0.056117 -0.057842 -0.057837 0.057251 0.057250
polarizability: 3.14868920e+02 -1.14582285e-04 2.09881664e+02 2.45797965e-02 -4.13981392e-03 6.22020019e+01
1716.lowfreq: -66.0626 -65.7816 -8.2932 -0.0007 0.0005 0.0008 5.8940 6.6871 27.0869
frequency: -66.0620 -65.7790 27.0833 94.7430 107.9056 117.3527 175.8295 196.5309 261.9070 279.6165 297.9098 341.6622 344.3551 380.6949 386.2178 398.3131 484.6627 502.1767 523.3421 524.5623 526.6588 550.0395 569.5694 616.0160 644.1191 656.1746 691.7660 693.1246 724.9306 744.5374 757.4291 775.1130 806.1649 833.6007 851.5910 868.7089 936.5245 941.3276 964.5812 965.3407 1006.2344 1006.5217 1064.6470 1065.9356 1140.6948 1156.7446 1158.4509 1171.7045 1174.8247 1190.1800 1244.3510 1263.5320 1281.9975 1318.8751 1362.0628 1367.3232 1377.3994 1379.3451 1429.9613 1449.2251 1468.7066 1503.0002 1530.5365 1540.6107 1595.3081 1626.2822 3157.0915 3157.1658 3174.2218 3174.5397 3185.3705 3185.4669
redmass: 15.8649 15.5130 8.0497 5.3749 13.4890 8.9534 4.5104 12.6904 5.8555 4.6912 9.4466 8.8848 8.1919 7.9611 11.0248 7.5056 3.7077 6.6180 4.5112 8.9112 9.1453 5.9333 3.7595 11.0148 9.4950 6.0762 6.7445 8.4360 11.1303 3.0174 11.8095 1.8137 6.7408 1.7503 3.1189 6.5366 9.0829 8.0563 1.3671 1.3773 1.3673 1.3662 1.8367 1.9882 2.3562 1.6662 1.4078 11.4277 3.2731 3.2504 2.9829 5.9257 2.5270 3.1037 2.4911 5.3175 6.2595 12.2509 3.6414 4.0813 3.6024 9.6671 7.1819 7.6709 6.1185 7.2595 1.0877 1.0876 1.0934 1.0934 1.0982 1.0983
irintensity: 0.0002 0.7167 0.0000 5.9124 0.5947 0.5873 0.0000 1.9116 0.0000 0.0670 3.0199 0.2721 0.2409 1.5000 3.0835 7.3104 0.0000 0.0886 0.0017 1.1998 3.6287 0.0068 0.7609 1.2779 8.4255 1.5528 39.5830 0.0000 39.8970 0.0000 12.1838 80.9387 22.8495 0.0000 49.9822 8.7169 18.7588 9.7533 1.2820 0.0000 4.3491 0.0001 15.8094 5.3717 5.3962 16.0729 7.4835 141.5925 225.8625 143.8161 16.2385 1.8142 0.3455 7.5080 1.4980 4.3734 116.9086 7.9982 64.1626 9.2450 0.1802 30.2371 52.4992 31.0336 5.5153 0.8505 0.8118 4.0300 17.9181 0.3096 0.5877 11.8577
temp: 298.150 k
press: 1.00000 atm
elementType: 8 8 8 8 7 7 7 7 6 6 6 6 6 6 6 6 6 6 6 6 1 1 1 1 1 1
symmnumber: 1
zpe: 439451.1 jmol-1
zpe.correction: 0.167378 hartree
zpe.thermalcorrener: 0.180753 hartree
zpe.thermalcorrenthalpy: 0.181697 hartree
zpe.thermalcorrgfe: 0.126543 hartree
zpe.sumelectzpe: -979.215290 hartree
zpe.sumelectthermal: -979.201915 hartree
zpe.sumelectthermalent: -979.200971 hartree
zpe.sumelectthermalfe: -979.256125 hartree
dipole: 0.0000 -9.3924 -0.0001
dipole: 9.3924
quadrupole: -97.9050 -126.7259 -111.9189
quadrupole: -0.0004 -0.0064 -0.0001
quadrupole: 14.2782 -14.5426 0.2643 -0.0004 -0.0064 -0.0001
hfenergy: -979.3826686 hartree
pointgroup: C01 [X(C12H6N4O4)]
dipole: 0.0001543 3.6952385 0.0000384 debye
dipolederiv: -0.8382949 0.2403537 0.0006755 0.3843018 -0.631958 -0.0000745 0.0008676 -0.0002391 -0.2440584 -0.4723829 -0.0285102 0.0006249 -0.0575175 -0.5778658 0.0005289 0.000596 0.0001954 -0.1647445 -0.8383622 -0.2403534 0.0002892 -0.3842789 -0.6319068 -0.0000064 0.0002953 0.0000734 -0.2440593 -0.4723691 0.0285174 0.0002728 0.0574994 -0.5778792 -0.0002568 0.0002419 -0.0001174 -0.1647425 -0.3467739 0.0000095 0.0000403 0.0000097 -0.0609918 -0.0000225 -0.0001557 0.0000502 -0.2153528 0.034577 -0.0000112 0.0000043 -0.0000056 -0.1959086 -0.0000134 0.0000961 -0.0000096 -0.2792606 1.1079712 -0.2000621 -0.0015877 -0.5112996 1.5238141 -0.0005307 -0.0015138 -0.0001027 0.1886781 1.1080443 0.2001002 -0.0006646 0.5113446 1.5237765 0.0003434 -0.0005501 0.0000877 0.1886808 0.3720343 -0.0853478 0.0001363 -0.3602119 -0.0453174 -0.0000153 0.0001481 0.0001552 0.122745 0.3720715 0.0853096 0.0000538 0.3601896 -0.04535 -0.0000031 0.0000716 -0.0001195 0.1227468 -0.0361646 -0.0717089 -0.0000276 0.3513639 -0.1018604 0.0000501 -0.0000435 -0.0000597 0.1556437 -0.0361869 0.0717092 -0.0000112 -0.351378 -0.101839 -0.0000372 -0.0001475 0.0000409 0.1556425 -0.0567665 -0.1737737 0.0002327 0.1612223 -0.4855616 0.0001201 0.000076 0.0002372 0.0373884 -0.056772 0.1737355 0.0001093 -0.1612735 -0.48559 -0.000085 0.0000623 -0.0001304 0.0373859 0.1522764 -0.0962602 0.0000011 0.0670691 0.1777948 -0.0000025 0.0000096 -0.0000577 -0.1346298 0.1522819 0.0962623 0.0000144 -0.0670668 0.1777939 -0.0000011 0.000042 0.0000447 -0.1346291 -0.1735058 0.1277218 -0.0000088 -0.3070636 0.2673386 -0.0000231 0.000054 -0.0002109 -0.0746314 -0.173487 -0.1276789 -0.0000239 0.3071065 0.267331 0.0000366 0.00003 0.0001048 -0.0746294 -0.0523821 0.2869881 -0.0000526 0.4248261 -0.1581597 0.0000012 -0.0000792 -0.0000575 -0.1341141 -0.0524443 -0.287002 -0.0000351 -0.4248391 -0.1581016 -0.0000227 -0.0000361 0.000015 -0.1341144 0.0987787 0.0349166 -0.0000022 -0.0398367 -0.0114626 0.0000091 -0.0000279 0.0000599 0.1655873 0.0987792 -0.0349262 -0.0000019 0.0398274 -0.0114634 -0.0000094 -0.0000143 -0.0000268 0.1655869 0.0917557 0.0229625 -0.000038 0.0288112 0.1333067 0.0000089 -0.0000071 0.0001086 0.1680713 0.0917525 -0.0229583 -0.0000192 -0.0288069 0.1333138 -0.0000015 -0.0000105 -0.0000491 0.1680705 -0.0372212 -0.0816147 0.0000152 -0.0609835 0.0383789 0.0000179 0.0000018 0.0000218 0.1613698 -0.0372091 0.0816215 0.0000031 0.0609902 0.0383679 -0.000011 -0.0000067 -0.0000142 0.1613695 unknown
polarizability: 314.8689199|-0.0048258|209.8816646|-0.02458|-0.0041387|62.2020019 unknown
InChI: InChI=1S/C12H6N4O4/c17-15(18)9-5-1-3-7-11(9)14-12-8(13-7)4-2-6-10(12)16(19)20/h1-6H
charge 0 multiplicity 1
26 atoms
O  3.884842 -2.363434 -0.001042
O  1.63633 -2.706769 0.002255
O  -3.885033 -2.363056 0.000049
O  -1.636538 -2.706598 -0.001259
N  -0.000012 -0.499638 -0.000066
N  0.000111 2.377287 -0.000082
N  2.65759 -1.935927 0.000557
N  -2.657737 -1.935683 -0.000522
C  1.17157 0.201418 0.000056
C  -1.171535 0.20152 -0.000155
C  1.171691 1.671881 -0.000068
C  -1.171529 1.671979 -0.000073
C  2.471864 -0.44541 0.000138
C  -2.471884 -0.445199 -0.000267
C  2.400274 2.413758 -0.000189
C  -2.400048 2.413962 -0.000038
C  3.645355 0.309454 -0.000067
C  -3.64531 0.309767 -0.000193
C  3.614392 1.739495 -0.000226
C  -3.614225 1.739805 -0.000077
H  2.331598 3.505445 -0.000266
H  -2.331279 3.505643 0.000018
H  4.597116 -0.228809 -0.000052
H  -4.597117 -0.228416 -0.000249
H  4.559051 2.291217 -0.000333
H  -4.558837 2.291608 -0.000049
