program: Gaussian 09
title: 000151554
version: EM64L-G09RevD.01
frameworkgroup: C1[X(C15H12ClNO5)]
method: RPBEPBE
basis: SDD
operation: Freq
keyword: #p
keyword: freq=noraman
keyword: PBEPBE/SDD
title: #p freq=noraman PBEPBE/SDD
converged: YES YES NO NO
title: Mulliken charges:
elementType: Cl O O O O O N C C C C C C C C C C C C C C C H H H H H H H H H H H H
charge: -0.052024 -0.331796 -0.409011 -0.235753 -0.422097 -0.335538 -0.453030 0.573621 -0.601713 -0.363779 0.106232 0.197340 -0.315511 -0.391240 0.118518 0.421463 -0.322896 -0.365739 0.167113 -0.205369 -0.180302 -0.120579 0.256259 0.309809 0.368499 0.271094 0.252418 0.252334 0.258765 0.252531 0.258007 0.260693 0.390097 0.391585
chargesum: 0.00000
title: Mulliken charges with hydrogens summed into heavy atoms:
elementType: Cl O O O O O N C C C C C C C C C C C C C C C
charge: -0.052024 -0.331796 -0.018913 -0.235753 -0.030512 -0.335538 -0.084531 0.573621 -0.345454 -0.053970 0.106232 0.197340 -0.044417 0.113512 0.118518 0.421463 -0.064131 -0.113208 0.167113 0.052637 0.080390 -0.120579
polarizability: 3.54799685e+02 1.27874622e+01 2.12111829e+02 4.37992727e-02 9.75944841e-02 7.85050715e+01
1716.lowfreq: 0.0011 0.0014 0.0017 2.4464 5.6634 10.5708 17.4655 28.2490 33.6502
frequency: 17.4536 28.2162 33.6495 48.3143 65.3229 108.7975 116.9726 121.2625 131.8012 143.6256 156.5379 229.6316 239.2937 255.2857 276.9381 300.8816 319.2447 321.0674 357.7268 411.6260 414.9040 432.8698 452.5425 472.0373 496.6657 509.8707 559.3021 571.7380 571.7792 584.5524 624.4528 632.2627 640.3642 668.7967 686.9354 694.7743 724.9022 751.7769 785.9420 786.4297 804.9800 820.0156 822.4285 848.6443 858.5120 882.4031 902.6572 931.5400 952.3791 984.9305 992.3563 997.3944 998.8241 1003.8394 1027.0216 1073.8953 1111.4025 1124.4392 1174.4232 1176.6946 1188.5575 1206.1531 1213.7336 1224.2147 1240.4736 1291.4609 1311.6691 1320.6924 1340.4577 1375.2609 1378.8117 1404.6953 1405.1551 1450.4144 1452.9640 1476.1512 1497.8621 1516.8123 1584.0433 1587.2873 1589.7157 1606.7618 1629.7930 1660.3169 2980.7783 3009.2851 3044.9998 3153.0476 3159.2233 3159.7713 3168.1966 3177.5464 3181.2146 3204.4247 3459.4303 3532.2863
redmass: 8.1078 4.3369 9.7941 7.8833 8.2570 6.4678 8.2126 8.2289 9.1074 7.2216 2.8624 7.5184 5.5820 8.3643 8.9714 5.0154 7.1151 7.5884 7.0849 7.5840 2.9874 10.8525 2.8269 7.0978 2.7314 5.4429 5.5979 6.1983 1.2765 3.3203 7.0477 4.3523 7.0186 5.5992 3.3392 3.5742 5.2398 2.8513 4.8093 1.3689 1.2725 6.4867 1.5512 1.1279 1.4173 1.6837 5.8650 1.3393 1.3488 3.9901 4.0052 1.3160 5.4473 1.8099 4.7679 2.6110 1.3042 1.6788 1.5479 1.2093 2.0900 1.0700 3.5741 1.9111 2.0329 1.2668 2.0702 2.2150 1.4493 4.4243 4.4117 3.6510 7.1194 1.7723 1.5495 2.1259 3.2839 2.3167 5.5939 4.1563 6.0754 6.2683 5.6868 5.2902 1.0555 1.0689 1.1064 1.0923 1.0882 1.0888 1.0908 1.0968 1.0978 1.0957 1.0762 1.0641
irintensity: 0.0542 0.0081 0.0792 1.1116 2.8863 0.7456 3.2217 3.0153 4.1216 6.8062 7.2343 0.7556 0.8255 1.1860 0.3710 1.7845 0.9101 2.1179 25.1357 15.9220 0.0440 6.1781 22.2409 14.2740 23.2479 24.6242 4.8888 3.2605 108.5043 3.0745 0.2240 4.0005 4.6167 109.3924 47.8298 0.0790 6.4431 2.6837 4.2518 26.6979 9.7822 18.5467 81.2828 208.9852 16.7696 64.3902 5.4925 0.2338 0.1785 82.9719 42.2637 1.4999 70.2844 1.1001 312.0031 43.4281 16.8445 151.6959 149.5284 23.3987 12.6618 2.3146 374.9698 82.8666 12.4205 0.6191 187.6029 16.9313 0.7807 143.6501 379.6386 4.0288 27.4639 287.0684 22.8417 268.4593 115.2181 477.0916 62.6032 217.7815 27.6748 36.8595 283.5358 384.1725 18.9849 302.3052 12.9462 4.4547 10.6076 0.3445 1.3060 4.5703 0.7623 5.1770 159.3138 85.4070
temp: 298.150 k
press: 1.00000 atm
elementType: 17 8 8 8 8 8 7 6 6 6 6 6 6 6 6 6 6 6 6 6 6 6 1 1 1 1 1 1 1 1 1 1 1 1
symmnumber: 1
zpe: 642508.2 jmol-1
zpe.correction: 0.244718 hartree
zpe.thermalcorrener: 0.264196 hartree
zpe.thermalcorrenthalpy: 0.265140 hartree
zpe.thermalcorrgfe: 0.193909 hartree
zpe.sumelectzpe: -1468.191994 hartree
zpe.sumelectthermal: -1468.172517 hartree
zpe.sumelectthermalent: -1468.171572 hartree
zpe.sumelectthermalfe: -1468.242804 hartree
dipole: 0.5326 0.9265 0.0136
dipole: 1.0688
quadrupole: -131.0179 -140.9150 -137.6612
quadrupole: -0.0882 0.0731 0.1063
quadrupole: 5.5135 -4.3837 -1.1298 -0.0882 0.0731 0.1063
hfenergy: -1468.4367123 hartree
pointgroup: C01 [X(C15H12Cl1N1O5)]
dipole: -0.2233742 0.0133338 0.3560028 debye
polarizability: 354.2659165|-19.0759883|79.8807921|-7.2946283|-2.2249342|211.2698767 unknown
InChI: InChI=1S/C15H12ClNO5/c16-9-1-4-11(5-2-9)22-8-14(19)17-10-3-6-12(15(20)21)13(18)7-10/h1-7,17-18,20H,8H2
charge 0 multiplicity 1
34 atoms
Cl -7.949883 0.634993 -1.60724
O  -2.216834 0.200149 0.208032
O  3.923009 -0.16092 -2.617685
O  0.160416 -0.028795 2.942176
O  6.803164 -0.437286 0.50068
O  6.369268 -0.353592 -1.772868
N  0.346718 0.010904 0.581705
C  1.741962 -0.080559 0.358495
C  2.176729 -0.079001 -0.987155
C  2.685849 -0.171435 1.429375
C  4.512409 -0.258825 -0.222803
C  3.550938 -0.16667 -1.290974
C  4.047586 -0.258583 1.121952
C  -1.865854 0.149463 1.631383
C  -0.341281 0.034357 1.783292
C  -3.579784 0.303428 -0.139642
C  -4.630888 0.363827 0.805804
C  -3.854223 0.344245 -1.527402
C  5.925193 -0.349985 -0.571594
C  -5.966842 0.465328 0.353275
C  -5.185205 0.445266 -1.976952
C  -6.227178 0.504374 -1.027652
H  1.468404 -0.010632 -1.819358
H  2.332538 -0.171403 2.460928
H  -0.261195 0.074258 -0.244837
H  4.786764 -0.32903 1.925143
H  -2.329481 -0.728663 2.122384
H  -2.198103 1.068092 2.152938
H  -4.437813 0.334243 1.881625
H  -3.026174 0.296831 -2.240609
H  -6.78851 0.512925 1.073348
H  -5.406984 0.47735 -3.04724
H  4.941535 -0.231013 -2.662805
H  7.73325 -0.495242 0.153179
