program: Gaussian 09
title: 000151543
version: EM64L-G09RevD.01
frameworkgroup: C1[X(C20H16O7)]
method: RPBEPBE
basis: SDD
operation: Freq
keyword: #pfreq=noraman
keyword: PBEPBE/SDD
title: #p freq=noraman PBEPBE/SDD
converged: YES YES NO NO
title: Mulliken charges:
elementType: O O O O O O O C C C C C C C C C C C C C C C C C C C C H H H H H H H H H H H H H H H H
charge: -0.186003 -0.233826 -0.276275 -0.273771 -0.247303 -0.264035 -0.173000 -0.285043 -0.100827 -0.446195 0.072801 -0.322932 0.286389 0.045015 0.129307 -0.559275 0.204760 0.083851 0.074700 0.214943 0.239064 -0.401908 -0.385824 -0.189680 -0.513034 0.241023 -0.767552 0.278230 0.254423 0.247112 0.235033 0.243135 0.224757 0.282195 0.266032 0.266289 0.241835 0.264780 0.237230 0.205075 0.244127 0.259696 0.284679
chargesum: 0.00000
title: Mulliken charges with hydrogens summed into heavy atoms:
elementType: O O O O O O O C C C C C C C C C C C C C C C C C C C C
charge: -0.186003 -0.233826 -0.276275 -0.273771 -0.247303 -0.264035 -0.173000 -0.006813 0.153596 0.035951 0.072801 0.144961 0.286389 0.045015 0.129307 -0.277080 0.204760 0.083851 0.074700 0.214943 0.239064 -0.135876 -0.119535 0.052155 0.194051 0.241023 0.020951
polarizability: 3.49274310e+02 -4.46363607e+00 2.80167223e+02 1.24528668e+01 -5.80651670e+00 1.32759656e+02
1716.lowfreq: -3.2254 -0.0003 0.0004 0.0004 3.1468 6.0228 22.0791 32.2097 45.1581
frequency: 21.5369 32.1819 45.1521 51.4925 59.7409 81.6082 90.1229 104.0055 121.1214 129.5151 134.0171 149.8123 161.4071 181.0020 209.5579 230.2949 239.0407 267.7814 274.5187 291.9544 309.4760 330.2224 357.0454 359.4678 398.7138 416.1035 450.3168 456.6958 485.7632 490.5417 508.0408 512.2731 531.8589 565.6780 579.8980 593.4687 605.1569 619.6916 630.6834 647.5764 656.4305 685.0583 712.3661 718.8052 742.5762 757.7652 789.0977 791.5611 812.2497 823.6994 842.9905 856.5697 868.0716 876.4286 884.1442 894.2508 896.0889 928.4683 948.7935 965.4550 977.9577 993.3710 1030.0986 1033.2388 1036.0944 1047.6976 1065.5527 1072.6855 1098.4527 1104.3357 1136.8816 1151.1238 1153.4383 1156.9013 1170.4397 1172.5884 1194.9301 1214.4905 1226.6905 1232.5617 1255.9841 1258.6714 1284.0675 1289.9803 1309.7204 1323.4233 1335.0542 1364.8445 1371.3652 1380.2014 1394.1163 1425.3865 1429.9228 1438.7048 1448.4981 1449.0396 1464.1903 1467.1290 1477.3175 1482.7031 1485.2142 1543.0133 1567.5243 1588.6822 1605.4282 1636.8644 1718.5086 2971.4811 3007.1555 3009.9536 3028.6059 3054.3683 3086.1686 3102.3117 3103.6432 3117.7129 3121.9877 3132.2349 3135.5843 3151.1398 3170.4120 3182.1260 3192.8846
redmass: 6.1779 5.5294 8.1008 5.0336 4.9579 3.4516 3.2453 2.7657 4.6347 1.2765 1.3487 2.9038 4.1559 5.3735 3.6436 5.4580 4.3306 4.7207 8.1770 5.2777 6.1972 9.3561 7.6416 7.0066 5.9830 6.5744 4.4421 6.8770 4.5925 4.5430 7.5822 3.1467 8.3244 4.9826 5.5683 6.1023 6.5922 7.2625 3.5881 5.5149 5.1697 5.4374 6.0435 4.5020 3.7296 6.2996 2.5126 4.8924 3.1795 4.0070 6.1274 3.4840 2.1037 4.4335 2.6836 1.4334 3.6915 2.4992 3.4689 2.3793 1.3357 5.6866 4.4111 1.6839 2.5085 5.3467 2.2831 1.8655 1.4692 2.0687 2.5726 1.4158 1.5373 1.7928 1.1981 1.2729 2.0433 2.2215 2.3421 2.2301 1.5354 1.5631 2.3012 3.5738 1.7323 1.4439 1.3213 5.1561 1.2693 9.8278 6.2241 1.3846 2.9860 3.0184 1.0921 1.0622 1.1446 1.0669 3.2097 1.0866 1.0955 8.5021 8.4534 9.3417 7.9494 10.2998 10.8827 1.0342 1.0357 1.0663 1.0632 1.0855 1.0990 1.0981 1.1014 1.0967 1.0978 1.1036 1.1006 1.0874 1.0925 1.0996 1.0932
irintensity: 1.6902 0.7711 1.2927 0.2650 0.7349 3.2914 4.9758 4.5203 0.5040 0.1900 0.4839 4.7666 1.0691 2.2042 3.2289 1.8780 5.9230 0.7937 1.1113 3.0820 4.5299 3.0877 0.7724 2.6409 0.6901 13.0415 7.5909 1.2895 11.0235 4.7217 13.1959 2.5142 10.5829 33.7477 9.5034 13.4863 4.6846 4.0544 25.7447 6.6597 23.3480 5.1730 14.0960 25.0880 14.2960 127.7064 41.3628 49.7062 42.6996 5.3167 7.4349 104.0504 35.9737 12.9941 22.2894 0.1373 16.4965 97.0751 11.2098 91.3976 3.5813 79.7925 241.5718 21.8498 110.1913 113.9377 24.2732 4.6584 7.5900 61.8200 382.2660 17.2350 64.9645 7.1244 3.7466 5.4369 24.0416 44.6056 16.5529 38.0739 3.1278 0.8346 6.9698 201.4115 8.3421 3.6994 5.6408 137.0233 57.0547 43.3186 23.4478 27.4528 12.0432 152.0225 15.6623 16.4799 4.0565 11.7704 82.5712 11.1032 7.7544 270.2284 217.4340 244.7802 199.5623 291.3803 317.4420 94.5648 3.6466 33.9533 17.9843 10.3892 19.5352 3.9699 14.1401 19.0275 42.1523 14.6054 10.3740 6.5340 2.9522 6.3063 0.0575
temp: 298.150 k
press: 1.00000 atm
elementType: 8 8 8 8 8 8 8 6 6 6 6 6 6 6 6 6 6 6 6 6 6 6 6 6 6 6 6 1 1 1 1 1 1 1 1 1 1 1 1 1 1 1 1
symmnumber: 1
zpe: 836239.1 jmol-1
zpe.correction: 0.318507 hartree
zpe.thermalcorrener: 0.341687 hartree
zpe.thermalcorrenthalpy: 0.342632 hartree
zpe.thermalcorrgfe: 0.264850 hartree
zpe.sumelectzpe: -1296.352590 hartree
zpe.sumelectthermal: -1296.329409 hartree
zpe.sumelectthermalent: -1296.328465 hartree
zpe.sumelectthermalfe: -1296.406246 hartree
dipole: 2.9168 -5.8577 4.4959
dipole: 7.9394
quadrupole: -181.2533 -137.2856 -154.1073
quadrupole: 5.6500 -14.0552 7.6760
quadrupole: -23.7046 20.2632 3.4414 5.6500 -14.0552 7.6760
hfenergy: -1296.6710969 hartree
pointgroup: C01 [X(C20H16O7)]
dipole: -0.9766476 2.3635663 1.7934622 debye
polarizability: 348.3550049|-10.2593896|281.157186|-8.3719619|9.2503267|132.6889975 unknown
InChI: InChI=1S/C20H16O7/c1-9(21)25-11-4-3-5-12-16(11)18(22)17-13(23-2)8-14-15(19(17)26-12)10-6-7-24-20(10)27-14/h3-5,8,10,20H,6-7H2,1-2H3
charge 0 multiplicity 1
43 atoms
O  -5.577529 1.003557 -0.360887
O  -4.402771 -1.017393 0.329604
O  -0.433002 1.496087 0.591666
O  -0.247836 -3.296001 -0.710317
O  2.076845 -1.773223 0.000268
O  4.084228 0.034018 -0.772819
O  5.496533 -1.7524 -0.57364
C  -3.423743 1.227229 0.750535
C  -4.779914 0.427162 0.671737
C  -3.587099 2.319127 -0.357837
C  -2.389719 0.165077 0.443667
C  -4.647654 1.710026 -1.294942
C  -3.018105 -1.069821 0.189793
C  -0.996028 0.230256 0.347939
C  -0.192464 -0.915014 0.038154
C  -2.301486 -2.22902 -0.159618
C  -0.894548 -2.150952 -0.233785
C  1.280848 -0.776476 0.003076
C  1.803951 0.623518 0.026395
C  0.936291 1.702249 0.356711
C  3.16677 0.969227 -0.2520
C  1.36992 3.03825 0.473601
C  3.614221 2.302196 -0.16744
C  2.720151 3.331055 0.210455
C  0.392536 -4.19452 0.276953
C  4.785172 -0.941112 0.026577
C  4.627987 -0.813148 1.528212
H  -3.271221 1.683834 1.742022
H  -5.398286 0.350451 1.576124
H  -2.633305 2.53289 -0.865704
H  -3.967941 3.25376 0.089436
H  -5.259019 2.445285 -1.837917
H  -4.215291 0.980587 -2.005661
H  -2.803211 -3.169727 -0.394418
H  0.648463 3.812218 0.747869
H  4.65563 2.51921 -0.421933
H  3.078063 4.362944 0.281637
H  1.245534 -3.685614 0.753525
H  0.747175 -5.052266 -0.313244
H  -0.353873 -4.528267 1.02423
H  4.740419 0.231661 1.86503
H  5.38353 -1.445559 2.016598
H  3.622978 -1.167761 1.812049
