program: Gaussian 09
title: 000151524
version: EM64L-G09RevD.01
frameworkgroup: C1[X(C12H8N2O2)]
method: RPBEPBE
basis: SDD
operation: Freq
keyword: #p
keyword: freq=noraman
keyword: PBEPBE/SDD
title: #p freq=noraman PBEPBE/SDD
converged: YES YES NO YES
title: Mulliken charges:
elementType: O O N N C C C C C C C C C C C C H H H H H H H H
charge: -0.212986 -0.219603 -0.485324 0.012002 0.095346 0.189315 0.256752 0.210371 0.262953 -0.394077 -0.333919 -0.373019 -0.422243 -0.187738 -0.278182 -0.203602 0.312432 0.244911 0.308031 0.237077 0.285478 0.237860 0.229547 0.228618
chargesum: 0.00000
title: Mulliken charges with hydrogens summed into heavy atoms:
elementType: O O N N C C C C C C C C C C C C
charge: -0.212986 -0.219603 -0.172892 0.012002 0.095346 0.189315 0.256752 0.210371 0.262953 -0.149167 -0.025888 -0.135942 -0.136765 0.050122 -0.048634 0.025016
polarizability: 2.50827467e+02 -1.54844299e+01 1.81381305e+02 -8.27528377e-04 4.25839100e-03 5.68825664e+01
1716.lowfreq: -6.6897 -3.7235 -3.0615 0.0004 0.0005 0.0009 16.3807 74.4307 121.9991
frequency: 16.3122 74.4300 121.9975 188.8670 189.5615 251.0030 295.9160 306.7834 366.2946 398.3602 435.9981 475.5761 485.9800 514.2354 542.9198 561.7262 571.3618 571.6174 634.3262 656.4160 700.6482 719.5463 728.0456 761.9547 767.8644 788.0189 805.0423 858.1457 864.4741 914.6658 958.1448 959.4675 979.2036 981.8190 997.8765 1026.5178 1080.3353 1114.2805 1152.1191 1163.7978 1183.2039 1205.3570 1227.2259 1242.7796 1286.9930 1296.0611 1351.7994 1365.3471 1394.9351 1417.2869 1448.1207 1459.0838 1467.8629 1492.4349 1566.1317 1578.1447 1621.9531 1634.8446 3131.4971 3140.9069 3145.7303 3164.1478 3165.2129 3191.3327 3232.5827 3611.2771
redmass: 14.3683 5.2943 4.6475 4.4389 9.7534 6.4799 4.8409 4.5965 8.1466 7.4063 3.1959 7.6635 4.7055 1.1289 5.1516 4.2089 3.4198 6.4308 7.2480 6.3524 7.5820 2.5395 7.8250 1.9298 2.0116 6.7944 1.8944 5.2750 1.4290 1.3960 1.3659 7.0594 1.3298 7.4526 1.3183 2.0481 1.7480 2.0504 2.0825 1.1595 1.2227 6.3516 1.6571 1.7911 2.2714 2.8628 2.5007 7.5081 3.9273 3.2468 2.5529 3.8575 3.9491 3.7495 6.4461 6.3196 6.7384 7.9139 1.0862 1.0890 1.0920 1.0987 1.0939 1.0951 1.0926 1.0805
irintensity: 0.0486 1.3475 1.7469 0.2366 2.0863 0.0536 0.1619 1.8367 2.2090 1.1864 8.3299 0.4432 0.0350 92.8514 1.8912 3.8056 2.5628 4.3861 5.7000 6.1434 8.3583 59.1537 8.5591 70.6488 7.2689 7.5122 67.3043 2.1186 0.0337 0.0100 3.8472 9.6281 2.6605 4.7950 0.6668 9.3486 16.7240 8.9299 10.0796 12.9313 3.5007 366.0716 16.7765 3.5301 2.2892 10.9951 135.1513 102.7272 34.5126 20.4000 28.3492 22.5785 18.1209 17.9901 12.1671 0.0757 37.6577 33.0413 0.9524 4.6146 18.9603 34.3927 10.7535 5.0158 11.3471 61.9632
temp: 298.150 k
press: 1.00000 atm
elementType: 8 8 7 7 6 6 6 6 6 6 6 6 6 6 6 6 1 1 1 1 1 1 1 1
symmnumber: 1
zpe: 460585.6 jmol-1
zpe.correction: 0.175428 hartree
zpe.thermalcorrener: 0.187062 hartree
zpe.thermalcorrenthalpy: 0.188006 hartree
zpe.thermalcorrgfe: 0.136441 hartree
zpe.sumelectzpe: -720.881490 hartree
zpe.sumelectthermal: -720.869856 hartree
zpe.sumelectthermalent: -720.868912 hartree
zpe.sumelectthermalfe: -720.920477 hartree
dipole: 2.9481 6.4698 0.0003
dipole: 7.1098
quadrupole: -84.6958 -83.1819 -95.9966
quadrupole: -7.7232 0.0025 0.0005
quadrupole: 3.2623 4.7762 -8.0385 -7.7232 0.0025 0.0005
hfenergy: -721.0569175 hartree
pointgroup: C01 [X(C12H8N2O2)]
dipole: 0.9661916 2.6250536 0.0001103 debye
dipolederiv: -0.9263876 -0.337141 0.0001544 -0.3577637 -0.6427371 0.0000357 0.0002831 0.0000998 -0.2349595 -0.5210152 0.2112078 0.0002323 0.0464713 -0.7109353 -0.0001513 0.0001093 -0.0000673 -0.230476 -0.8687079 0.1313997 -0.0000149 0.0841851 -0.5194927 0.00002 -0.0000126 0.000035 -0.3163709 1.1873301 0.1625152 -0.0004424 0.6041611 1.6818826 0.0001398 -0.0004091 0.0000256 0.1879292 0.4288374 0.3126117 0.0000257 -0.6031449 -0.0103853 -0.0000136 -0.0000346 -0.0000651 -0.0056968 -0.2854991 -0.3198314 -0.0000166 0.2288229 -0.099105 0.0000038 -0.000007 -0.0000163 -0.0171798 0.515709 0.2819579 0.0000275 0.8983636 -0.1022315 0.0000159 0.0000596 -0.0000224 0.0843856 0.3481696 -0.3810497 0. -0.3795853 0.5312675 -0.0000076 -0.0000193 -0.0000028 0.08176 0.2011622 -0.0871583 0.0000667 -0.3539599 -0.6776819 -0.0000379 0.0000195 -0.0000275 0.0521502 0.2450466 -0.0101532 0.0000007 0.0054384 0.1360893 0.0000098 0.0000048 0.0000189 -0.1774257 0.2351933 0.1300456 0.0000261 -0.2832076 -0.0225374 -0.0000088 -0.0000012 0.0000154 -0.1076142 -0.141965 0.2806814 0.0000147 0.1468088 -0.0745172 0.0000114 0.0000141 0.0000175 -0.2184376 -0.355784 -0.1176238 -0.0000103 0.3763059 0.087019 0.0000136 0.0000255 0.0000594 -0.1294751 -0.1434909 -0.1012181 -0.0000084 -0.3910875 -0.0571978 0. -0.0000217 0.0000079 -0.1537371 -0.3307449 -0.2081604 -0.0000078 -0.2089181 0.004804 0.0000048 0.0000107 0.0000092 -0.1952355 0.0875451 0.0114763 0.0000138 0.1253864 0.2065182 0.0000135 0.0000212 0.000022 -0.1338256 0.1383241 0.0340364 -0.000007 0.0311932 0.2122702 -0.00001 -0.000009 -0.000017 0.3428196 0.0946848 -0.0475221 -0.0000035 0.0016203 -0.0853182 -0.0000092 0.0000016 -0.0000166 0.1740734 0.1813795 -0.0612047 -0.0000149 -0.0049186 0.0485075 -0.000003 -0.0000045 -0.0000159 0.1613379 0.0311581 -0.0513364 -0.0000081 -0.1108603 -0.0712472 -0.0000129 -0.0000107 -0.0000129 0.1805567 0.0613033 -0.0156873 -0.0000112 -0.0524437 0.1086197 -0.0000057 0.0000132 -0.0000244 0.1726669 -0.0501343 0.0952951 0.0000014 0.0802477 0.0275815 -0.0000033 -0.000004 -0.0000066 0.1605655 0.0105834 0.0812082 -0.0000049 0.1112492 -0.0696015 -0.0000039 -0.0000038 -0.0000119 0.1646114 -0.1426976 0.005651 -0.0000133 0.0056358 0.0984285 -0.0000012 -0.000025 -0.000004 0.1575774 unknown
polarizability: 252.7491731|-10.1301268|179.4595982|-0.0011438|0.0041845|56.8825664 unknown
InChI: InChI=1S/C12H8N2O2/c15-14(16)11-7-3-6-10-12(11)8-4-1-2-5-9(8)13-10/h1-7,13H
charge 0 multiplicity 1
24 atoms
O  -3.147727 -2.327943 0.000425
O  -0.904034 -2.665607 -0.000487
N  0.91084 2.076596 0.00016
N  -1.931931 -1.883578 -0.000099
C  -0.415323 0.177667 0.000026
C  0.995041 -0.235161 0.000061
C  -0.411287 1.629268 0.000102
C  1.778671 0.979197 0.00015
C  -1.714753 -0.420755 -0.000002
C  -1.572696 2.423992 0.000121
C  1.699898 -1.472259 0.000047
C  3.188378 0.98928 0.000219
C  -2.892729 0.364474 0.000042
C  -2.823139 1.773106 0.000094
C  3.107505 -1.469365 0.000135
C  3.848193 -0.254993 0.000215
H  1.196649 3.052891 0.000253
H  -1.506744 3.517159 0.000163
H  1.147992 -2.40982 -0.000044
H  3.750807 1.929105 0.000278
H  -3.853512 -0.15484 0.000033
H  -3.746891 2.359524 0.000111
H  3.642577 -2.424689 0.000127
H  4.943316 -0.28665 0.000269
