program: Gaussian 09
title: 000151523
version: EM64L-G09RevD.01
frameworkgroup: C1[X(C9H10N2O2)]
method: RPBEPBE
basis: SDD
operation: Freq
keyword: #p
keyword: freq=noraman
keyword: PBEPBE/SDD
title: #p freq=noraman PBEPBE/SDD
converged: NO YES NO NO
title: Mulliken charges:
elementType: O O N N C C C C C C C C C H H H H H H H H H H
charge: -0.229867 -0.226000 -0.124750 0.086810 -0.598514 0.486758 -0.378433 -0.371389 -0.225658 -0.232268 0.305550 -0.231835 -0.741429 0.253863 0.258215 0.258048 0.262020 0.228553 0.228696 0.230759 0.247335 0.257720 0.255816
chargesum: 0.00000
title: Mulliken charges with hydrogens summed into heavy atoms:
elementType: O O N N C C C C C C C C C
charge: -0.229867 -0.226000 -0.124750 0.086810 -0.086436 0.486758 -0.120385 -0.109368 0.002895 -0.003572 0.305550 -0.001076 0.019441
polarizability: 1.33291545e+02 -5.13679937e-01 1.34756209e+02 8.93698991e+00 -3.94658210e+00 7.29012345e+01
1716.lowfreq: -12.5061 -5.7176 -0.0004 0.0005 0.0006 7.6854 29.3152 57.0823 66.2935
frequency: 29.2062 56.9981 66.2333 100.3817 123.5170 183.7323 221.0100 228.4305 273.4761 369.3625 389.5115 405.3503 424.6354 471.1505 499.3585 561.8622 608.4687 616.7508 629.4471 706.5751 739.9515 799.9077 818.8725 837.9465 862.8842 932.9788 943.1465 985.9305 989.8333 1001.1678 1022.8937 1026.8111 1038.2015 1084.2120 1093.2782 1173.7108 1190.3929 1208.3121 1246.6818 1303.0623 1337.3298 1349.4279 1367.9800 1385.2398 1388.5481 1443.5884 1444.8019 1445.5508 1454.5162 1483.4278 1594.0531 1611.7872 1629.1681 3013.5749 3038.5576 3102.2794 3105.3642 3125.6332 3132.6144 3141.4680 3143.2374 3152.4856 3166.3485
redmass: 5.0144 4.0928 4.7483 5.1520 1.1086 5.8624 5.7374 6.7885 4.8768 6.0111 1.9984 2.8363 4.4382 6.2765 4.4340 3.2636 4.2090 6.2161 4.6790 2.0003 2.1516 3.6732 3.3570 2.7495 1.2661 1.9740 1.7854 1.3925 5.7191 1.3335 2.4493 2.2588 1.6824 2.6369 1.5762 1.0538 1.1292 2.8962 2.0846 1.9758 1.2551 1.5552 6.9020 5.9027 1.2471 1.4486 1.5082 1.0765 1.0467 2.2183 6.0454 5.9908 8.6464 1.0365 1.0589 1.0968 1.1039 1.0848 1.0881 1.1017 1.0927 1.0968 1.1017
irintensity: 0.1638 0.9732 1.2721 8.1036 0.0913 1.2252 6.2948 4.3361 8.4999 3.1366 2.5664 0.0280 0.8212 10.1147 17.7415 3.8842 19.0451 0.0220 25.4255 47.1375 69.7651 11.0718 5.8607 146.8916 2.4035 34.6225 22.0441 0.4801 0.1669 0.5216 29.6224 6.4646 8.2942 49.9300 4.4316 0.0148 1.4601 4.4853 77.0763 113.1188 2.2470 64.9040 104.7279 0.5400 63.3259 13.3963 27.7358 13.7802 19.4662 16.0564 2.8073 2.6003 102.2730 0.4869 11.3191 4.6913 0.1351 0.3218 3.3259 10.0873 13.6410 23.5323 19.6516
temp: 298.150 k
press: 1.00000 atm
elementType: 8 8 7 7 6 6 6 6 6 6 6 6 6 1 1 1 1 1 1 1 1 1 1
symmnumber: 1
zpe: 462491.9 jmol-1
zpe.correction: 0.176154 hartree
zpe.thermalcorrener: 0.188360 hartree
zpe.thermalcorrenthalpy: 0.189304 hartree
zpe.thermalcorrgfe: 0.136398 hartree
zpe.sumelectzpe: -607.900807 hartree
zpe.sumelectthermal: -607.888601 hartree
zpe.sumelectthermalent: -607.887657 hartree
zpe.sumelectthermalfe: -607.940563 hartree
dipole: -0.1795 -0.5188 -0.3308
dipole: 0.6409
quadrupole: -65.9222 -83.4849 -74.3766
quadrupole: -1.0253 1.1493 3.3710
quadrupole: 8.6723 -8.8903 0.2180 -1.0253 1.1493 3.3710
hfenergy: -608.0769609 hartree
pointgroup: C01 [X(C9H10N2O2)]
dipole: 0.0739503 -0.2022528 0.1311745 debye
dipolederiv: -0.5326251 0.0345917 0.1222785 -0.1497445 -0.9372519 -0.1033176 0.1169713 -0.1906738 -0.4512121 -0.212671 -0.4687187 -0.028769 0.125451 -1.0374704 -0.1243895 0.0016066 0.2679976 -0.1832327 -0.4938094 -0.0399572 0.0770111 -0.3004766 -1.3373708 0.0024969 0.0920953 -0.1753065 -0.2564452 -0.0806557 0.0715936 -0.0188932 -0.2033423 1.5299967 0.2563051 0.089975 0.224304 0.0366155 0.3956646 -0.0011007 0.0518079 -0.0292893 0.0375702 -0.0270879 -0.0701186 -0.0054989 0.2618903 0.1919267 -0.0435575 0.0655437 -0.0382287 0.0015536 0.0050802 0.1088381 -0.0252401 -0.1384447 -0.1222336 -0.066635 0.0358192 -0.0133971 -0.0047691 -0.0134705 0.0094716 0.0010063 -0.1227562 -0.1068496 0.0919369 0.048578 0.0548276 -0.0212009 0.0153545 0.02379 0.0186289 -0.1178663 -0.0346645 0.1014208 0.0607944 0.0944568 0.0712962 0.0435487 0.0670904 0.0601402 -0.1130635 -0.0764387 -0.0809636 0.0390955 -0.0824079 0.1171633 -0.0162208 0.0395073 -0.028408 -0.1278289 0.8830407 0.4292718 -0.3730156 0.5525967 1.5041185 0.0106292 -0.463176 -0.1039029 0.5360963 0.0434249 -0.0178332 0.1135067 -0.0114528 -0.0489425 -0.0073225 0.0957325 -0.0064988 -0.1018396 -0.2515844 -0.0064613 0.2025187 0.0818784 0.0320282 -0.0760254 0.2725742 0.000357 -0.1767154 0.0097335 0.0132339 -0.0001098 0.0018831 -0.0060364 0.1260316 0.0105232 -0.0013736 0.0776081 0.0138865 0.002384 -0.032292 -0.0107534 0.0497689 -0.1198088 -0.0089143 -0.0355525 0.0663992 0.1066771 0.0875899 -0.0408294 0.0584176 -0.0172267 0.0209101 -0.037577 0.0168689 0.1272432 0.0846168 -0.0871463 -0.0608064 -0.0765802 0.0247627 -0.0257476 -0.0549147 -0.0317255 0.1187888 0.0222592 -0.0787963 -0.0576689 -0.0968681 -0.0429678 -0.0472279 -0.0694369 -0.0443771 0.1257677 0.0588694 0.0653535 -0.0383543 0.0835594 -0.0898207 0.0250006 -0.0479022 0.0251286 0.1377664 -0.0797039 0.027077 -0.1083793 0.0270086 0.0885573 0.0105841 -0.1166225 0.0101348 0.1075721 0.0750043 -0.0416015 0.0300258 -0.1013009 -0.0550103 0.0432469 0.0283082 0.0051264 0.1070161 0.0634164 -0.0405576 -0.0702555 -0.0462529 0.0914305 -0.0588169 -0.0376509 -0.0405969 0.007287 0.042716 0.0488759 -0.0176059 0.0800153 0.0498213 0.0602476 -0.0501705 0.0594618 0.079354 unknown
polarizability: 133.3831584|0.581385|134.8244707|8.5208237|3.6045139|72.7413593 unknown
InChI: InChI=1S/C9H10N2O2/c1-8(12)11(10-13)7-9-5-3-2-4-6-9/h2-6H,7H2,1H3
charge 0 multiplicity 1
23 atoms
O  -1.920363 -2.024174 -0.428791
O  -1.39696 2.501317 0.001579
N  -1.586706 0.266817 -0.262308
N  -2.042075 1.458368 0.349211
C  -0.451017 0.248711 -1.234424
C  0.906104 0.05308 -0.565542
C  1.674853 1.17367 -0.159102
C  1.416051 -1.253713 -0.354495
C  2.937218 0.989554 0.448391
C  2.677915 -1.436151 0.254341
C  -2.275551 -0.941037 0.101233
C  3.441608 -0.315311 0.656869
C  -3.390392 -0.814488 1.119613
H  -0.491503 1.215821 -1.764434
H  -0.667584 -0.572942 -1.935506
H  1.279426 2.183726 -0.315513
H  0.820076 -2.120275 -0.663344
H  3.525758 1.860633 0.75735
H  3.065915 -2.448732 0.4114
H  4.421198 -0.457465 1.127029
H  -3.805433 -1.817517 1.296581
H  -3.015525 -0.39098 2.066775
H  -4.184015 -0.137414 0.761484
