program: Gaussian 09
title: 000151519
version: EM64L-G09RevD.01
frameworkgroup: C1[X(C4H8N2O3)]
method: RPBEPBE
basis: SDD
operation: Freq
keyword: #pfreq=noraman
keyword: PBEPBE/SDD
title: #p freq=noraman PBEPBE/SDD
converged: YES YES NO NO
title: Mulliken charges:
elementType: O O O N N C C C C H H H H H H H H
charge: -0.407701 -0.237303 -0.291026 -0.065309 0.061018 -0.305440 -0.492516 -0.624155 0.173479 0.245316 0.243942 0.279583 0.280316 0.240512 0.276438 0.241499 0.381347
chargesum: 0.00000
title: Mulliken charges with hydrogens summed into heavy atoms:
elementType: O O O N N C C C C
charge: -0.026354 -0.237303 -0.291026 -0.065309 0.061018 0.183818 0.067384 0.134294 0.173479
polarizability: 8.68286606e+01 6.22832170e+00 7.80041915e+01 2.19923091e-01 -4.18996544e-03 4.20752442e+01
1716.lowfreq: -21.2321 -6.9750 -1.7223 -0.0012 0.0006 0.0006 22.1783 38.3603 85.9456
frequency: 21.6909 37.8990 85.9311 89.0814 120.0072 212.7427 222.1078 319.1004 362.0971 372.0722 492.3373 512.5229 568.3411 643.3638 676.1335 788.8677 813.4443 875.3658 978.5535 1043.8690 1047.2607 1079.8654 1098.5529 1156.3817 1181.8450 1239.9212 1269.1143 1279.0856 1335.4050 1352.5363 1388.8716 1408.0624 1435.8966 1463.1329 1477.5921 1486.4691 1661.9722 2977.7149 2983.4997 3025.9992 3032.7366 3067.3286 3086.1467 3100.3330 3515.6347
redmass: 7.7993 2.5604 1.0707 2.3595 6.0512 3.8495 9.5920 3.6163 5.7924 6.9544 3.8995 1.7689 5.1116 1.3245 4.7881 1.3349 5.9115 4.6956 2.2497 3.4214 1.8529 2.1809 1.3267 2.5049 1.1951 1.8530 1.0897 3.3478 2.3714 4.2891 1.5310 1.3128 1.1025 1.0652 1.0480 1.0786 8.2292 1.0414 1.0497 1.1031 1.0619 1.1020 1.0993 1.0994 1.0640
irintensity: 5.6273 0.1239 0.1498 0.6750 9.1969 2.9087 0.2486 0.9252 17.4442 1.9459 12.0915 32.5174 41.3739 134.7921 3.6969 11.8483 18.9738 20.3271 115.2798 162.3389 11.4758 104.9974 0.3156 43.7073 1.3437 14.6496 0.7697 2.2388 146.6741 60.5283 34.4431 35.6088 33.4813 9.4974 25.0980 18.4503 213.7411 10.3430 40.1632 16.4744 3.8758 24.1781 4.9906 1.8890 27.4876
temp: 298.150 k
press: 1.00000 atm
elementType: 8 8 8 7 7 6 6 6 6 1 1 1 1 1 1 1 1
symmnumber: 1
zpe: 337268.5 jmol-1
zpe.correction: 0.128459 hartree
zpe.thermalcorrener: 0.138801 hartree
zpe.thermalcorrenthalpy: 0.139745 hartree
zpe.thermalcorrgfe: 0.090390 hartree
zpe.sumelectzpe: -491.622380 hartree
zpe.sumelectthermal: -491.612038 hartree
zpe.sumelectthermalent: -491.611093 hartree
zpe.sumelectthermalfe: -491.660449 hartree
dipole: 1.7257 2.4776 0.0456
dipole: 3.0197
quadrupole: -54.6336 -59.6802 -50.8832
quadrupole: -14.4500 -0.0152 0.0914
quadrupole: 0.4321 -4.6145 4.1825 -14.4500 -0.0152 0.0914
hfenergy: -491.7508389 hartree
pointgroup: C01[X(C4H8N2O3)]
dipole: 0.7162977 0.9435158 -0.090181 debye
dipolederiv: -0.7940151 0.5596675 -0.0501411 0.5122521 -0.8221806 0.0275445 -0.0454977 0.0260004 -0.42954 -0.7173949 -0.2042273 0.0347955 0.0569655 -0.9339983 0.0649335 0.0059234 0.0725614 -0.3167234 -0.9956399 -0.7660324 0.0866865 -0.059198 -0.454203 0.0216408 0.0222242 0.0371686 -0.2288687 -0.3212326 -0.062499 0.0069414 -0.5161013 -0.6902114 0.0525083 0.0545982 0.0439583 -0.2276329 0.6335745 0.8942553 -0.0955837 0.6935336 0.8713157 -0.0998871 -0.0770437 -0.1039378 -0.050438 0.5211452 0.1513551 -0.0152395 0.0465494 0.0652748 0.0234387 -0.0083155 0.0197108 0.3210386 -0.3080731 -0.0567367 0.0156063 -0.1552058 -0.0765802 0.0209927 0.0199796 0.0182893 0.1098203 -0.0438309 -0.1905406 0.0258601 -0.1063416 0.0682753 0.0179567 0.0183053 0.0215761 0.2437987 1.4325339 -0.1807729 -0.0147605 -0.305028 1.4658446 -0.1268887 0.0003767 -0.1301389 0.2096659 0.0087869 -0.0335429 -0.0065964 -0.016534 0.0256023 0.0797056 0.0420827 0.0973146 -0.0600421 -0.0010736 -0.0376103 0.0086445 -0.0291156 -0.00487 -0.0887887 -0.0441574 -0.106999 -0.0336013 0.0920591 -0.017155 -0.0067216 0.0413147 0.0534586 -0.0694413 -0.0201066 -0.07031 0.029406 0.0932472 -0.0106499 0.0038975 0.0485591 0.0733967 0.060367 0.0113967 0.0645349 0.008715 0.1150654 -0.0010393 -0.0819311 0.0184436 -0.0334092 -0.0795704 -0.0322658 -0.1150355 -0.0331352 -0.0124503 0.0329817 0.0028048 -0.1112999 0.1432175 0.0045481 0.0144335 -0.0009263 0.1387523 0.1195068 0.0209777 0.0679611 0.0284371 0.0010855 0.0703739 0.0154023 0.106951 -0.0752141 0.1777914 -0.0984311 0.0177761 -0.1472307 0.2479818 0.0205662 0.0226639 0.0192823 0.3939987 unknown
polarizability: 87.2686339|5.7376559|77.2061087|-1.6688042|-3.4116508|42.4333537 unknown
InChI: InChI=1S/C4H8N2O3/c1-6(5-9)3-2-4(7)8/h7H,2-3H2,1H3
charge 0 multiplicity 1
17 atoms
O  3.141763 -1.145892 0.092707
O  2.73238 1.127563 -0.14083
O  -3.094455 -1.163244 0.255856
N  -1.506123 0.432619 0.077401
N  -1.834981 -0.911637 0.205099
C  -0.073194 0.775373 0.017414
C  0.841692 -0.459944 0.082242
C  -2.513069 1.503853 0.009363
C  2.294401 -0.036973 -0.002574
H  0.123002 1.337457 -0.916454
H  0.167684 1.464123 0.851039
H  0.625629 -1.168374 -0.736858
H  0.685914 -1.03625 1.010486
H  -2.374594 2.219125 0.840537
H  -3.505025 1.028582 0.087874
H  -2.436569 2.048483 -0.949435
H  4.089044 -0.845164 0.030531
