program: Gaussian 09
title: 000151518
version: EM64L-G09RevD.01
frameworkgroup: C1[X(C10H10N2O2)]
method: RPBEPBE
basis: SDD
operation: Freq
keyword: #p
keyword: freq=noraman
keyword: PBEPBE/SDD
title: #p freq=noraman PBEPBE/SDD
converged: NO YES NO NO
title: Mulliken charges:
elementType: O O N N C C C C C C C C C C H H H H H H H H H H
charge: -0.244225 -0.265325 -0.462193 -0.422191 0.330247 0.299380 -0.496477 0.192456 0.164134 -0.382408 -0.239208 -0.261840 -0.218835 -0.522169 0.344274 0.234889 0.316452 0.240923 0.254191 0.248180 0.195937 0.222588 0.248624 0.222598
chargesum: 0.00000
title: Mulliken charges with hydrogens summed into heavy atoms:
elementType: O O N N C C C C C C C C C C
charge: -0.244225 -0.265325 -0.117919 -0.105739 0.330247 0.299380 -0.261588 0.192456 0.164134 -0.141486 0.014983 -0.013660 -0.022898 0.171641
polarizability: 2.35160344e+02 -1.71032482e+01 1.56334328e+02 -4.87807498e-03 7.17812243e-03 5.68532389e+01
1716.lowfreq: -21.9615 -6.0596 -5.3599 -0.0001 0.0004 0.0007 0.9858 71.2402 89.5106
frequency: -21.9601 71.2329 89.5082 100.3473 128.5736 168.8548 193.5903 221.0645 256.5916 267.8854 333.7601 384.8355 434.7615 442.0866 563.6472 567.1557 598.4697 627.5304 645.4580 663.4825 676.6525 699.3708 720.3009 765.2388 797.7404 809.5540 868.9175 874.5803 886.2045 946.7633 963.9592 983.8082 1046.7133 1062.7364 1112.8863 1114.8969 1131.3421 1153.0042 1161.1437 1218.0005 1260.5805 1277.3544 1323.7173 1369.2557 1374.9994 1410.3564 1420.6630 1427.8288 1447.9325 1464.9671 1469.6516 1487.8041 1498.2425 1524.4147 1585.7004 1621.9043 2958.6743 2964.3010 3053.9847 3134.7287 3206.3637 3214.2699 3223.6645 3247.6706 3576.6797 3610.6844
redmass: 3.4034 4.4731 5.3867 3.9724 5.0956 4.6530 1.3004 4.0319 2.5556 3.7720 6.7967 5.0429 5.2221 5.1203 1.3538 6.7911 2.3890 2.5515 2.0745 4.2047 2.1377 2.4515 1.2617 1.7581 1.4718 5.1902 5.6687 1.3495 5.2188 1.6593 3.4534 7.7302 1.3384 1.4657 1.2540 2.3235 1.3303 1.6512 3.3898 1.6754 1.5787 2.0141 1.8869 3.6175 2.8557 3.2942 4.3523 1.4537 4.9159 1.0504 1.0652 4.2131 3.7137 4.8629 5.7807 5.8497 1.0870 1.0327 1.1044 1.0999 1.0929 1.0968 1.0953 1.1081 1.0803 1.0810
irintensity: 0.7332 1.4727 1.7103 1.6512 1.7781 6.2085 1.8582 13.7188 8.7768 0.1637 0.2509 8.6127 4.4869 4.5334 65.4262 10.5569 0.1270 1.0953 13.7342 17.6912 5.2711 8.5622 136.3814 130.1739 30.4410 17.3749 1.3948 0.0102 12.1864 2.9179 17.1911 47.8285 44.1956 17.6008 0.0793 11.5428 45.4338 14.8010 78.7493 38.6284 44.7077 52.6842 43.2459 34.1913 58.3475 12.8187 15.8090 65.2752 26.9014 14.3443 22.5670 186.9192 25.4162 203.3103 469.9652 61.1701 93.6503 62.3377 47.2614 20.9859 4.8606 4.8729 2.7135 1.5743 78.6875 41.3349
temp: 298.150 k
press: 1.00000 atm
elementType: 8 8 7 7 6 6 6 6 6 6 6 6 6 6 1 1 1 1 1 1 1 1 1 1
symmnumber: 1
zpe: 483943.5 jmol-1
zpe.correction: 0.184324 hartree
zpe.thermalcorrener: 0.196134 hartree
zpe.thermalcorrenthalpy: 0.197078 hartree
zpe.thermalcorrgfe: 0.146006 hartree
zpe.sumelectzpe: -645.988167 hartree
zpe.sumelectthermal: -645.976358 hartree
zpe.sumelectthermalent: -645.975413 hartree
zpe.sumelectthermalfe: -646.026485 hartree
dipole: 3.0536 -6.6333 0.0012
dipole: 7.3025
quadrupole: -78.2098 -76.8323 -86.7191
quadrupole: 11.3370 -0.0133 0.0228
quadrupole: 2.3773 3.7547 -6.1320 11.3370 -0.0133 0.0228
hfenergy: -646.1724913 hartree
pointgroup: C01 [X(C10H10N2O2)]
dipole: 1.3261533 -2.5486295 0.0004647 debye
dipolederiv: -0.8644228 -0.8653016 0.0002383 -0.600484 -1.1700875 0.0002362 0.0001664 0.000198 -0.2746571 -0.4128157 -0.0855223 -0.0000485 0.8780405 -1.3987877 0.000008 -0.0013555 0.001717 -0.3673809 0.0712899 -0.2712046 0.0000014 -0.0241897 -0.6249875 0.00009 0.000023 -0.0001304 -0.2175441 0.2357539 -0.2972426 -0.000297 -0.2260693 -0.5178682 -0.0003081 0.0000767 -0.0001852 -0.2297832 0.824255 0.0818255 -0.000052 0.4689556 0.3077968 -0.0001467 0.0001599 -0.0000527 0.1088776 -0.4143906 0.0364745 -0.0000805 -0.1387157 0.2965085 0.0004543 -0.0002968 0.0003307 -0.0097952 -0.7693135 -0.0788415 0.0000558 -0.2901742 -0.0874171 -0.0001062 0.0000315 -0.0000578 -0.3276339 -1.0977385 0.7785239 -0.0001912 0.5283533 -0.7169968 0.0002454 -0.0004575 0.0002502 -0.0465057 1.1672221 0.7400672 -0.0002765 0.2399514 0.9690109 -0.0001335 0.0001666 -0.0003798 0.0878986 0.3061847 -0.0691268 -0.0000808 0.0013725 -0.0886501 0.000267 -0.0001597 0.0002645 -0.2355486 -0.5328663 0.297345 0.0003056 -0.1488587 0.2357334 0.0004758 -0.000274 0.0004724 -0.1997605 -0.241592 0.0450798 0.0000179 0.4140077 -0.1172559 0.0001494 0.0006414 0.000079 -0.2352037 1.1378438 -0.4949236 0.0004955 -1.0792234 1.6115637 -0.000344 0.0024248 -0.0019489 0.0791051 0.1983909 -0.0150864 0.0000043 0.3309854 0.8816553 -0.0001591 -0.0000443 -0.0000997 0.3333087 0.1877274 0.0243149 0.0000092 -0.0814278 0.2446348 0.000007 0.0000111 0.0001067 0.3087472 0.0793322 0.0777166 -0.0000145 0.05527 -0.0465931 0.0000715 -0.000106 0.0000593 0.2046273 0.205586 -0.0521899 -0.0000484 -0.0691863 0.1972046 -0.0001614 -0.0001042 -0.0001916 0.322495 0.0927555 0.08711 0.0001096 0.0590685 -0.0182642 -0.0002948 0.00003 -0.000266 0.1981576 0.0368643 0.0549254 0.0000895 0.0744916 0.0230847 -0.000259 0.0000094 -0.0002282 0.2250779 -0.0425699 -0.069007 -0.0000735 -0.0793862 0.0715437 -0.0001507 -0.0000339 -0.0001384 0.2026692 -0.2068603 -0.0542768 -0.0001391 -0.1734791 0.0298295 0.0000354 -0.000936 0.0001964 0.1225704 0.0690207 0.1254835 0.1198369 -0.0326601 -0.0536337 -0.0285183 0.0737591 -0.0838669 -0.0868983 -0.098677 -0.1215777 0.0000262 -0.0739447 0.0255686 0.0000266 0.0000157 0.0000227 0.1241134 0.0690203 0.1254343 -0.1198884 -0.0326973 -0.0535925 0.0285155 -0.0737478 0.0838489 -0.0869369 unknown
polarizability: 236.6278235|-13.2171116|154.8668488|-0.0052194|0.0069339|56.8532389 unknown
InChI: InChI=1S/C10H10N2O2/c1-14-10-5-8(12-9(10)6-13)7-3-2-4-11-7/h2-6,11-12H,1H3
charge 0 multiplicity 1
24 atoms
O  -2.959402 -1.483414 0.000366
O  -2.602529 2.906808 -0.002193
N  -0.424364 1.050958 -0.000028
N  2.679861 -1.07755 -0.001613
C  0.404962 -0.053874 -0.000068
C  1.848526 0.052678 -0.000195
C  -0.426896 -1.212799 0.000202
C  -1.774494 0.666505 0.000064
C  -1.776974 -0.757578 0.00019
C  2.697468 1.181632 0.000984
C  4.016022 -0.687833 -0.001301
C  4.051391 0.715371 0.00042
C  -2.828677 1.647479 0.000013
C  -2.809806 -2.943949 0.000657
H  -0.156199 2.035905 -0.000232
H  -0.084302 -2.246069 0.000516
H  2.347977 -2.039709 -0.002913
H  2.378124 2.223311 0.002351
H  4.823111 -1.416984 -0.002281
H  4.950072 1.329142 0.001115
H  -3.863443 1.241453 -0.001437
H  -2.272749 -3.285065 -0.905307
H  -3.834449 -3.341515 0.000746
H  -2.27273 -3.284705 0.906744
